{"text_format":"1","workbook":"xlsx","n_sheets":3,"sheets":["Seznam","průměrné umístění","průběžné bodové pořadí"],"not_rendered":{"charts":0,"images":0,"macros":1,"external_links":0,"defined_names":12,"comments":0,"pivot_tables":0},"unopened":[],"bounds":{"document_bytes":16777216,"sheet_cells":100000,"rows_first":2000,"rows_last":500,"rows_between":2000,"halvings":0,"cell_chars":16384,"cell_head_chars":4096},"cells_cut":0,"cells_raw":0,"read":"whole","date_system":"1900"}

{"sheet":"Seznam","index":0,"n_rows":203,"n_cols":4,"rows_kept":203,"cut":false,"hidden":false,"merged":[[0,0,0,3]]}
["Seznam hráčů OBTM Frýdek-Místek 2016-2017"]
[]
["č.h.","Jméno","oddílúklub","nar."]
[1,"Jančák Richard","Brušperk",2006]
[2,"Blahuta Petr","SK Frýdlant",2006]
[3,"Muroň Ondřej","TTC Frýdlant",2004]
[4,"Kozel Ladislav","TTC Frýdlant",2004]
[5,"Janečka Martin","Brušperk",2002]
[6,"Rybák Tomáš","SK Frýdlant",2006]
[7,"Pařil Ondřej","Kopřivnice",2003]
[8,"Kociánová Natálie","TTC Frýdlant",2009]
[9,"Šlachta Prokop Antonín","Frýdek - Místek",2006]
[10,"Kuchař Andrej","CDU Ostrava",2004]
[11,"Ščerbová Barbora","SK Frýdlant",2005]
[12,"Gavendová Andrea","CDU Ostrava",2006]
[13,"Neuwirth Jaroslav","Brušperk",2002]
[14,"Káňa Tomáš","SK Frýdlant",2007]
[15,"Rozkydalová Eliška","Frýdlant",2002]
[16,"Lasota Laurent","Lištná",2001]
[17,"Michnová Marika","SK Frýdlant",2008]
[18,"Kubala Patrik","SK Frýdlant",2001]
[19,"Přikryl Václav","TTC Frýdlant",2005]
[20,"Mrowetz Bruno","Brušperk",2004]
[21,"Dudková Jana","TTC Frýdlant",2007]
[22,"Byrtus David","Český Těšín",2004]
[23,"Voneš Otmar","Frýdlant",2006]
[24,"Břenek Jiří","Karviná",2009]
[25,"Smetana Jan","Třinec",2008]
[26,"Malyjurek David","Mosty u Jablunkova",2004]
[27,"Hýl Jakub","Brušperk",2006]
[28,"Domenyová Klára","Český Těšín",2003]
[29,"Karásek Kryštof","TTC Frýdlant",2005]
[30,"Olejník Oliver","TTC F-M",2011]
[31,"Strašák Filip","Třinec",2007]
[32,"Szotkowski Jan","Dolní Lomná",2003]
[33,"Lichna Matěj","Havířov",2006]
[34,"Kufa Radek","Jablunkov",2002]
[35,"Moravec Václav","Paskov",2008]
[36,"Slaný Vojtěch","Paskov",2005]
[37,"Huta Lukáš","Třinec",2006]
{"$rows_left_out":164}
{"sheet":"průměrné umístění","index":1,"n_rows":154,"n_cols":13,"rows_kept":154,"cut":false,"hidden":false,"merged":[[0,1,0,12],[0,24,0,28],[1,18,1,22],[1,24,1,28]]}
[null,"NASAZOVACÍ  ŽEBŘÍČEK  NA  ZÁKLADĚ  PRŮMĚRNÉHO  UMÍSTĚNÍ"]
[]
[null,null,null,null,null,null,1,2,3,4,5]
["poř.","č.h.","Jméno","oddíl/klub","nar.","průměr 2017/2018","Frýdlant","Brušperk","ČT","ČT",null,"počet turnajů + výchozí pořadí","průměrné umístění"]
[1,59,{"$f":"IF($B5=\"\",\"\",VLOOKUP($B5,Seznam!$A$4:$D$500,2))","v":"Szotkowski Jan"},{"$f":"IF($B5=\"\",\"\",VLOOKUP($B5,Seznam!$A$4:$D$500,3))","v":"Třinec"},{"$f":"IF($B5=\"\",\"\",VLOOKUP($B5,Seznam!$A$4:$D$500,4))","v":2006},2,null,null,1,1,null,{"$f":"IF(AND(F5=\"\",G5=\"\",H5=\"\",I5=\"\",J5=\"\",K5=\"\"),\"\",COUNTA(F5:K5))","v":3},{"$f":"IF(OR(F5>0,G5>0,H5>0,I5>0,J5>0,K5>0),ROUNDUP(SUM(F5:K5)/L5,1),\"\")","v":1.4000000000000001}]
[2,13,{"$f":"IF($B6=\"\",\"\",VLOOKUP($B6,Seznam!$A$4:$D$500,2))","v":"Neuwirth Jaroslav"},{"$f":"IF($B6=\"\",\"\",VLOOKUP($B6,Seznam!$A$4:$D$500,3))","v":"Brušperk"},{"$f":"IF($B6=\"\",\"\",VLOOKUP($B6,Seznam!$A$4:$D$500,4))","v":2002},2.6,1,3,null,null,null,3,2.2000000000000002]
[3,20,{"$f":"IF($B7=\"\",\"\",VLOOKUP($B7,Seznam!$A$4:$D$500,2))","v":"Mrowetz Bruno"},{"$f":"IF($B7=\"\",\"\",VLOOKUP($B7,Seznam!$A$4:$D$500,3))","v":"Brušperk"},{"$f":"IF($B7=\"\",\"\",VLOOKUP($B7,Seznam!$A$4:$D$500,4))","v":2004},3.5,null,1,null,null,null,2,2.3000000000000003]
[4,16,{"$f":"IF($B8=\"\",\"\",VLOOKUP($B8,Seznam!$A$4:$D$500,2))","v":"Lasota Laurent"},{"$f":"IF($B8=\"\",\"\",VLOOKUP($B8,Seznam!$A$4:$D$500,3))","v":"Lištná"},{"$f":"IF($B8=\"\",\"\",VLOOKUP($B8,Seznam!$A$4:$D$500,4))","v":2001},2.5,null,null,null,null,null,1,2.5]
[5,5,{"$f":"IF($B9=\"\",\"\",VLOOKUP($B9,Seznam!$A$4:$D$500,2))","v":"Janečka Martin"},{"$f":"IF($B9=\"\",\"\",VLOOKUP($B9,Seznam!$A$4:$D$500,3))","v":"Brušperk"},{"$f":"IF($B9=\"\",\"\",VLOOKUP($B9,Seznam!$A$4:$D$500,4))","v":2002},3.9,null,2,null,null,null,2,3]
[6,107,{"$f":"IF($B10=\"\",\"\",VLOOKUP($B10,Seznam!$A$4:$D$500,2))","v":"Jokiel Patrik"},{"$f":"IF($B10=\"\",\"\",VLOOKUP($B10,Seznam!$A$4:$D$500,3))","v":"Český Těšín"},{"$f":"IF($B10=\"\",\"\",VLOOKUP($B10,Seznam!$A$4:$D$500,4))","v":2001},null,null,null,6,3,null,2,4.5]
[7,27,{"$f":"IF($B11=\"\",\"\",VLOOKUP($B11,Seznam!$A$4:$D$500,2))","v":"Hýl Jakub"},{"$f":"IF($B11=\"\",\"\",VLOOKUP($B11,Seznam!$A$4:$D$500,3))","v":"Brušperk"},{"$f":"IF($B11=\"\",\"\",VLOOKUP($B11,Seznam!$A$4:$D$500,4))","v":2006},9.7999999999999989,2,4,null,null,null,3,5.3]
[8,71,{"$f":"IF($B12=\"\",\"\",VLOOKUP($B12,Seznam!$A$4:$D$500,2))","v":"Lisztwán Jan"},{"$f":"IF($B12=\"\",\"\",VLOOKUP($B12,Seznam!$A$4:$D$500,3))","v":"Vendryně"},{"$f":"IF($B12=\"\",\"\",VLOOKUP($B12,Seznam!$A$4:$D$500,4))","v":2005},5.6999999999999993,null,null,null,null,null,1,5.7]
[9,36,{"$f":"IF($B13=\"\",\"\",VLOOKUP($B13,Seznam!$A$4:$D$500,2))","v":"Slaný Vojtěch"},{"$f":"IF($B13=\"\",\"\",VLOOKUP($B13,Seznam!$A$4:$D$500,3))","v":"Paskov"},{"$f":"IF($B13=\"\",\"\",VLOOKUP($B13,Seznam!$A$4:$D$500,4))","v":2005},6.3,null,null,null,null,null,1,6.3]
[10,38,{"$f":"IF($B14=\"\",\"\",VLOOKUP($B14,Seznam!$A$4:$D$500,2))","v":"Zvrtek Jan"},{"$f":"IF($B14=\"\",\"\",VLOOKUP($B14,Seznam!$A$4:$D$500,3))","v":"Návsí"},{"$f":"IF($B14=\"\",\"\",VLOOKUP($B14,Seznam!$A$4:$D$500,4))","v":2004},null,null,17,2,2,null,3,7]
[11,97,{"$f":"IF($B15=\"\",\"\",VLOOKUP($B15,Seznam!$A$4:$D$500,2))","v":"Bakota Adam"},{"$f":"IF($B15=\"\",\"\",VLOOKUP($B15,Seznam!$A$4:$D$500,3))","v":"Frýdlant"},{"$f":"IF($B15=\"\",\"\",VLOOKUP($B15,Seznam!$A$4:$D$500,4))","v":2006},12.299999999999999,null,5,4,null,null,3,7.1]
[12,138,{"$f":"IF($B16=\"\",\"\",VLOOKUP($B16,Seznam!$A$4:$D$500,2))","v":"Halfar Jan"},{"$f":"IF($B16=\"\",\"\",VLOOKUP($B16,Seznam!$A$4:$D$500,3))","v":"Český Těšín"},{"$f":"IF($B16=\"\",\"\",VLOOKUP($B16,Seznam!$A$4:$D$500,4))","v":2005},null,null,null,11,4,null,2,7.5]
[13,43,{"$f":"IF($B17=\"\",\"\",VLOOKUP($B17,Seznam!$A$4:$D$500,2))","v":"Stávek Jan"},{"$f":"IF($B17=\"\",\"\",VLOOKUP($B17,Seznam!$A$4:$D$500,3))","v":"Malenovice"},{"$f":"IF($B17=\"\",\"\",VLOOKUP($B17,Seznam!$A$4:$D$500,4))","v":2003},7.8999999999999995,null,null,null,null,null,1,7.9]
[14,40,{"$f":"IF($B18=\"\",\"\",VLOOKUP($B18,Seznam!$A$4:$D$500,2))","v":"Pohanka Marek"},{"$f":"IF($B18=\"\",\"\",VLOOKUP($B18,Seznam!$A$4:$D$500,3))","v":"Paskov"},{"$f":"IF($B18=\"\",\"\",VLOOKUP($B18,Seznam!$A$4:$D$500,4))","v":2001},9.8000000000000007,null,6,null,null,null,2,7.9]
[15,95,{"$f":"IF($B19=\"\",\"\",VLOOKUP($B19,Seznam!$A$4:$D$500,2))","v":"Ondračka Adam"},{"$f":"IF($B19=\"\",\"\",VLOOKUP($B19,Seznam!$A$4:$D$500,3))","v":"Frýdlant"},{"$f":"IF($B19=\"\",\"\",VLOOKUP($B19,Seznam!$A$4:$D$500,4))","v":2007},18,3,null,3,null,null,3,8]
[16,121,{"$f":"IF($B20=\"\",\"\",VLOOKUP($B20,Seznam!$A$4:$D$500,2))","v":"Kotajný Jakub"},{"$f":"IF($B20=\"\",\"\",VLOOKUP($B20,Seznam!$A$4:$D$500,3))","v":"Vendryně"},{"$f":"IF($B20=\"\",\"\",VLOOKUP($B20,Seznam!$A$4:$D$500,4))","v":2003},11,null,null,5,null,null,2,8]
[17,75,{"$f":"IF($B21=\"\",\"\",VLOOKUP($B21,Seznam!$A$4:$D$500,2))","v":"Duda Lukáš"},{"$f":"IF($B21=\"\",\"\",VLOOKUP($B21,Seznam!$A$4:$D$500,3))","v":"Návsí"},{"$f":"IF($B21=\"\",\"\",VLOOKUP($B21,Seznam!$A$4:$D$500,4))","v":2001},null,null,null,8,null,null,1,8]
[18,94,{"$f":"IF($B22=\"\",\"\",VLOOKUP($B22,Seznam!$A$4:$D$500,2))","v":"Turek Josef"},{"$f":"IF($B22=\"\",\"\",VLOOKUP($B22,Seznam!$A$4:$D$500,3))","v":"Dolní Lomná"},{"$f":"IF($B22=\"\",\"\",VLOOKUP($B22,Seznam!$A$4:$D$500,4))","v":2001},null,null,null,9,7,null,2,8]
[19,98,{"$f":"IF($B23=\"\",\"\",VLOOKUP($B23,Seznam!$A$4:$D$500,2))","v":"Hamar Tomáš"},{"$f":"IF($B23=\"\",\"\",VLOOKUP($B23,Seznam!$A$4:$D$500,3))","v":"Brušperk"},{"$f":"IF($B23=\"\",\"\",VLOOKUP($B23,Seznam!$A$4:$D$500,4))","v":2004},15.6,6,7,null,5,null,4,8.4]
[20,129,{"$f":"IF($B24=\"\",\"\",VLOOKUP($B24,Seznam!$A$4:$D$500,2))","v":"Staněk Michael"},{"$f":"IF($B24=\"\",\"\",VLOOKUP($B24,Seznam!$A$4:$D$500,3))","v":"Chotěbuz"},{"$f":"IF($B24=\"\",\"\",VLOOKUP($B24,Seznam!$A$4:$D$500,4))","v":2003},null,null,null,null,9,null,1,9]
[21,48,{"$f":"IF($B25=\"\",\"\",VLOOKUP($B25,Seznam!$A$4:$D$500,2))","v":"Michna Viktor"},{"$f":"IF($B25=\"\",\"\",VLOOKUP($B25,Seznam!$A$4:$D$500,3))","v":"Paskov"},{"$f":"IF($B25=\"\",\"\",VLOOKUP($B25,Seznam!$A$4:$D$500,4))","v":2004},12.2,7,null,null,8,null,3,9.1]
[22,82,{"$f":"IF($B26=\"\",\"\",VLOOKUP($B26,Seznam!$A$4:$D$500,2))","v":"Pánek Jakub"},{"$f":"IF($B26=\"\",\"\",VLOOKUP($B26,Seznam!$A$4:$D$500,3))","v":"Kozlovice"},{"$f":"IF($B26=\"\",\"\",VLOOKUP($B26,Seznam!$A$4:$D$500,4))","v":2005},16.7,5,8,null,null,null,3,9.9]
[23,33,{"$f":"IF($B27=\"\",\"\",VLOOKUP($B27,Seznam!$A$4:$D$500,2))","v":"Lichna Matěj"},{"$f":"IF($B27=\"\",\"\",VLOOKUP($B27,Seznam!$A$4:$D$500,3))","v":"Havířov"},{"$f":"IF($B27=\"\",\"\",VLOOKUP($B27,Seznam!$A$4:$D$500,4))","v":2006},11.7,null,null,null,null,null,1,11.7]
[24,64,{"$f":"IF($B28=\"\",\"\",VLOOKUP($B28,Seznam!$A$4:$D$500,2))","v":"Tabach René"},{"$f":"IF($B28=\"\",\"\",VLOOKUP($B28,Seznam!$A$4:$D$500,3))","v":"Kozlovice"},{"$f":"IF($B28=\"\",\"\",VLOOKUP($B28,Seznam!$A$4:$D$500,4))","v":2005},11.7,null,null,null,null,null,1,11.7]
[25,55,{"$f":"IF($B29=\"\",\"\",VLOOKUP($B29,Seznam!$A$4:$D$500,2))","v":"Ševeček Jan"},{"$f":"IF($B29=\"\",\"\",VLOOKUP($B29,Seznam!$A$4:$D$500,3))","v":"Brušperk"},{"$f":"IF($B29=\"\",\"\",VLOOKUP($B29,Seznam!$A$4:$D$500,4))","v":2005},17.3,8,10,null,null,null,3,11.799999999999999]
[26,9,{"$f":"IF($B30=\"\",\"\",VLOOKUP($B30,Seznam!$A$4:$D$500,2))","v":"Šlachta Prokop Antonín"},{"$f":"IF($B30=\"\",\"\",VLOOKUP($B30,Seznam!$A$4:$D$500,3))","v":"Frýdek - Místek"},{"$f":"IF($B30=\"\",\"\",VLOOKUP($B30,Seznam!$A$4:$D$500,4))","v":2006},20.3,4,null,null,null,null,2,12.2]
[27,39,{"$f":"IF($B31=\"\",\"\",VLOOKUP($B31,Seznam!$A$4:$D$500,2))","v":"Walek Adrian"},{"$f":"IF($B31=\"\",\"\",VLOOKUP($B31,Seznam!$A$4:$D$500,3))","v":"Návsí"},{"$f":"IF($B31=\"\",\"\",VLOOKUP($B31,Seznam!$A$4:$D$500,4))","v":2005},null,null,18,7,null,null,2,12.5]
[28,65,{"$f":"IF($B32=\"\",\"\",VLOOKUP($B32,Seznam!$A$4:$D$500,2))","v":"Stramová Eliška"},{"$f":"IF($B32=\"\",\"\",VLOOKUP($B32,Seznam!$A$4:$D$500,3))","v":"Frýdlant"},{"$f":"IF($B32=\"\",\"\",VLOOKUP($B32,Seznam!$A$4:$D$500,4))","v":2005},22,9,9,10,null,null,4,12.5]
[29,62,{"$f":"IF($B33=\"\",\"\",VLOOKUP($B33,Seznam!$A$4:$D$500,2))","v":"Neuwirth Ondřej"},{"$f":"IF($B33=\"\",\"\",VLOOKUP($B33,Seznam!$A$4:$D$500,3))","v":"Brušperk"},{"$f":"IF($B33=\"\",\"\",VLOOKUP($B33,Seznam!$A$4:$D$500,4))","v":2006},20.5,10,11,12,10,null,5,12.7]
[30,63,{"$f":"IF($B34=\"\",\"\",VLOOKUP($B34,Seznam!$A$4:$D$500,2))","v":"Jendrůlek Adam"},{"$f":"IF($B34=\"\",\"\",VLOOKUP($B34,Seznam!$A$4:$D$500,3))","v":"Ropice"},{"$f":"IF($B34=\"\",\"\",VLOOKUP($B34,Seznam!$A$4:$D$500,4))","v":2003},13,null,null,null,null,null,1,13]
[31,10,{"$f":"IF($B35=\"\",\"\",VLOOKUP($B35,Seznam!$A$4:$D$500,2))","v":"Kuchař Andrej"},{"$f":"IF($B35=\"\",\"\",VLOOKUP($B35,Seznam!$A$4:$D$500,3))","v":"CDU Ostrava"},{"$f":"IF($B35=\"\",\"\",VLOOKUP($B35,Seznam!$A$4:$D$500,4))","v":2004},13.5,null,null,null,null,null,1,13.5]
[32,3,{"$f":"IF($B36=\"\",\"\",VLOOKUP($B36,Seznam!$A$4:$D$500,2))","v":"Muroň Ondřej"},{"$f":"IF($B36=\"\",\"\",VLOOKUP($B36,Seznam!$A$4:$D$500,3))","v":"TTC Frýdlant"},{"$f":"IF($B36=\"\",\"\",VLOOKUP($B36,Seznam!$A$4:$D$500,4))","v":2004},19,null,14,15,13,null,4,15.299999999999999]
[33,17,{"$f":"IF($B37=\"\",\"\",VLOOKUP($B37,Seznam!$A$4:$D$500,2))","v":"Michnová Marika"},{"$f":"IF($B37=\"\",\"\",VLOOKUP($B37,Seznam!$A$4:$D$500,3))","v":"SK Frýdlant"},{"$f":"IF($B37=\"\",\"\",VLOOKUP($B37,Seznam!$A$4:$D$500,4))","v":2008},24,12,15,null,11,null,{"$f":"IF(AND(F37=\"\",G37=\"\",H37=\"\",I37=\"\",J37=\"\",K37=\"\"),\"\",COUNTA(F37:K37))","v":4},{"$f":"IF(OR(F37>0,G37>0,H37>0,I37>0,J37>0,K37>0),ROUNDUP(SUM(F37:K37)/L37,1),\"\")","v":15.5}]
[34,79,{"$f":"IF($B38=\"\",\"\",VLOOKUP($B38,Seznam!$A$4:$D$500,2))","v":"Červenka Jan"},{"$f":"IF($B38=\"\",\"\",VLOOKUP($B38,Seznam!$A$4:$D$500,3))","v":"Brušperk"},{"$f":"IF($B38=\"\",\"\",VLOOKUP($B38,Seznam!$A$4:$D$500,4))","v":2004},20.8,null,13,13,null,null,3,15.6]
[35,35,{"$f":"IF($B39=\"\",\"\",VLOOKUP($B39,Seznam!$A$4:$D$500,2))","v":"Moravec Václav"},{"$f":"IF($B39=\"\",\"\",VLOOKUP($B39,Seznam!$A$4:$D$500,3))","v":"Paskov"},{"$f":"IF($B39=\"\",\"\",VLOOKUP($B39,Seznam!$A$4:$D$500,4))","v":2008},15.7,null,null,null,null,null,1,15.7]
[36,2,{"$f":"IF($B40=\"\",\"\",VLOOKUP($B40,Seznam!$A$4:$D$500,2))","v":"Blahuta Petr"},{"$f":"IF($B40=\"\",\"\",VLOOKUP($B40,Seznam!$A$4:$D$500,3))","v":"SK Frýdlant"},{"$f":"IF($B40=\"\",\"\",VLOOKUP($B40,Seznam!$A$4:$D$500,4))","v":2006},17,null,null,null,null,null,1,17]
{"$rows_left_out":115}
{"sheet":"průběžné bodové pořadí","index":2,"n_rows":120,"n_cols":13,"rows_kept":120,"cut":false,"hidden":false,"merged":[[0,0,0,12]]}
["Průběžné bodové pořadí v jednotlivých kategoriích"]
[null,null,"První 3 v každé kat. obdrží věcné ceny"]
[null,null,"1.místo - 5 Bodů, 2.místo - 4 body, 3.místo - 3 body, 4.místo - 2 body, 5.místo - 1 bod."]
[null,null,"Počítají se 4 nejlepší výsledky"]
[null,null,null,null,null,1,2,3,4,5,6]
[null,null,"Dorost",null,null,"Fryd.","Brušp.","ČT","ČT","Fryd.",null,"počet turnajů","celkem      bodů"]
["poř.","č.h.","jméno","oddíl/klub","nar."]
["1.",59,{"$f":"IF($B8=\"\",\"\",VLOOKUP($B8,Seznam!$A$4:$K$500,2))","v":"Szotkowski Jan"},{"$f":"IF($B8=\"\",\"\",VLOOKUP($B8,Seznam!$A$4:$K$500,3))","v":"Třinec"},{"$f":"IF($B8=\"\",\"\",VLOOKUP($B8,Seznam!$A$4:$K$500,4))","v":2006},null,null,5,5,null,null,{"$f":"IF(AND(J8=\"\",F8=\"\",G8=\"\",H8=\"\",I8=\"\"),\"\",COUNTA(F8:J8))","v":2},{"$f":"IF(B8=\"\",0,SUM(IF(ISERROR(LARGE(F8:J8,1)),0,LARGE(F8:J8,1)),IF(ISERROR(LARGE(F8:J8,2)),0,LARGE(F8:J8,2)),IF(ISERROR(LARGE(F8:J8,3)),0,LARGE(F8:J8,3)),IF(ISERROR(LARGE(F8:J8,4)),0,LARGE(F8:J8,4))))","v":10}]
["2.",13,{"$f":"IF($B9=\"\",\"\",VLOOKUP($B9,Seznam!$A$4:$K$500,2))","v":"Neuwirth Jaroslav"},{"$f":"IF($B9=\"\",\"\",VLOOKUP($B9,Seznam!$A$4:$K$500,3))","v":"Brušperk"},{"$f":"IF($B9=\"\",\"\",VLOOKUP($B9,Seznam!$A$4:$K$500,4))","v":2002},5,3,null,null,null,null,{"$f":"IF(AND(J9=\"\",F9=\"\",G9=\"\",H9=\"\",I9=\"\"),\"\",COUNTA(F9:J9))","v":2},{"$f":"IF(B9=\"\",0,SUM(IF(ISERROR(LARGE(F9:J9,1)),0,LARGE(F9:J9,1)),IF(ISERROR(LARGE(F9:J9,2)),0,LARGE(F9:J9,2)),IF(ISERROR(LARGE(F9:J9,3)),0,LARGE(F9:J9,3)),IF(ISERROR(LARGE(F9:J9,4)),0,LARGE(F9:J9,4))))","v":8}]
["3.",38,{"$f":"IF($B10=\"\",\"\",VLOOKUP($B10,Seznam!$A$4:$K$500,2))","v":"Zvrtek Jan"},{"$f":"IF($B10=\"\",\"\",VLOOKUP($B10,Seznam!$A$4:$K$500,3))","v":"Návsí"},{"$f":"IF($B10=\"\",\"\",VLOOKUP($B10,Seznam!$A$4:$K$500,4))","v":2004},null,null,4,4,null,null,{"$f":"IF(AND(J10=\"\",F10=\"\",G10=\"\",H10=\"\",I10=\"\"),\"\",COUNTA(F10:J10))","v":2},{"$f":"IF(B10=\"\",0,SUM(IF(ISERROR(LARGE(F10:J10,1)),0,LARGE(F10:J10,1)),IF(ISERROR(LARGE(F10:J10,2)),0,LARGE(F10:J10,2)),IF(ISERROR(LARGE(F10:J10,3)),0,LARGE(F10:J10,3)),IF(ISERROR(LARGE(F10:J10,4)),0,LARGE(F10:J10,4))))","v":8}]
["4.",27,{"$f":"IF($B11=\"\",\"\",VLOOKUP($B11,Seznam!$A$4:$D$500,2))","v":"Hýl Jakub"},{"$f":"IF($B11=\"\",\"\",VLOOKUP($B11,Seznam!$A$4:$K$500,3))","v":"Brušperk"},{"$f":"IF($B11=\"\",\"\",VLOOKUP($B11,Seznam!$A$4:$K$500,4))","v":2006},4,2,null,null,null,null,{"$f":"IF(AND(J11=\"\",F11=\"\",G11=\"\",H11=\"\",I11=\"\",K11),\"\",COUNTA(F11:K11))","v":2},{"$f":"IF(B11=\"\",0,SUM(IF(ISERROR(LARGE(F11:K11,1)),0,LARGE(F11:K11,1)),IF(ISERROR(LARGE(F11:K11,2)),0,LARGE(F11:K11,2)),IF(ISERROR(LARGE(F11:K11,3)),0,LARGE(F11:K11,3)),IF(ISERROR(LARGE(F11:K11,4)),0,LARGE(F11:K11,4))))","v":6}]
["5.",95,{"$f":"IF($B12=\"\",\"\",VLOOKUP($B12,Seznam!$A$4:$K$500,2))","v":"Ondračka Adam"},{"$f":"IF($B12=\"\",\"\",VLOOKUP($B12,Seznam!$A$4:$K$500,3))","v":"Frýdlant"},{"$f":"IF($B12=\"\",\"\",VLOOKUP($B12,Seznam!$A$4:$K$500,4))","v":2007},3,null,3,null,null,null,{"$f":"IF(AND(J12=\"\",F12=\"\",G12=\"\",H12=\"\",I12=\"\"),\"\",COUNTA(F12:J12))","v":2},{"$f":"IF(B12=\"\",0,SUM(IF(ISERROR(LARGE(F12:J12,1)),0,LARGE(F12:J12,1)),IF(ISERROR(LARGE(F12:J12,2)),0,LARGE(F12:J12,2)),IF(ISERROR(LARGE(F12:J12,3)),0,LARGE(F12:J12,3)),IF(ISERROR(LARGE(F12:J12,4)),0,LARGE(F12:J12,4))))","v":6}]
["6.",20,{"$f":"IF($B13=\"\",\"\",VLOOKUP($B13,Seznam!$A$4:$K$500,2))","v":"Mrowetz Bruno"},{"$f":"IF($B13=\"\",\"\",VLOOKUP($B13,Seznam!$A$4:$K$500,3))","v":"Brušperk"},{"$f":"IF($B13=\"\",\"\",VLOOKUP($B13,Seznam!$A$4:$K$500,4))","v":2004},null,5,null,null,null,null,1,5]
["7.",5,{"$f":"IF($B14=\"\",\"\",VLOOKUP($B14,Seznam!$A$4:$K$500,2))","v":"Janečka Martin"},{"$f":"IF($B14=\"\",\"\",VLOOKUP($B14,Seznam!$A$4:$K$500,3))","v":"Brušperk"},{"$f":"IF($B14=\"\",\"\",VLOOKUP($B14,Seznam!$A$4:$K$500,4))","v":2002},null,4,null,null,null,null,1,4]
["8.",97,{"$f":"IF($B15=\"\",\"\",VLOOKUP($B15,Seznam!$A$4:$K$500,2))","v":"Bakota Adam"},{"$f":"IF($B15=\"\",\"\",VLOOKUP($B15,Seznam!$A$4:$K$500,3))","v":"Frýdlant"},{"$f":"IF($B15=\"\",\"\",VLOOKUP($B15,Seznam!$A$4:$K$500,4))","v":2006},null,1,2,null,null,null,2,3]
["9.",107,{"$f":"IF($B16=\"\",\"\",VLOOKUP($B16,Seznam!$A$4:$K$500,2))","v":"Jokiel Patrik"},{"$f":"IF($B16=\"\",\"\",VLOOKUP($B16,Seznam!$A$4:$K$500,3))","v":"Český Těšín"},{"$f":"IF($B16=\"\",\"\",VLOOKUP($B16,Seznam!$A$4:$K$500,4))","v":2001},null,null,null,3,null,null,1,3]
["10.",9,{"$f":"IF($B17=\"\",\"\",VLOOKUP($B17,Seznam!$A$4:$K$500,2))","v":"Šlachta Prokop Antonín"},{"$f":"IF($B17=\"\",\"\",VLOOKUP($B17,Seznam!$A$4:$K$500,3))","v":"Frýdek - Místek"},{"$f":"IF($B17=\"\",\"\",VLOOKUP($B17,Seznam!$A$4:$K$500,4))","v":2006},2,null,null,null,null,null,1,2]
["11.",138,{"$f":"IF($B18=\"\",\"\",VLOOKUP($B18,Seznam!$A$4:$K$500,2))","v":"Halfar Jan"},{"$f":"IF($B18=\"\",\"\",VLOOKUP($B18,Seznam!$A$4:$K$500,3))","v":"Český Těšín"},{"$f":"IF($B18=\"\",\"\",VLOOKUP($B18,Seznam!$A$4:$K$500,4))","v":2005},null,null,null,2,null,null,1,2]
["12.",82,{"$f":"IF($B19=\"\",\"\",VLOOKUP($B19,Seznam!$A$4:$K$500,2))","v":"Pánek Jakub"},{"$f":"IF($B19=\"\",\"\",VLOOKUP($B19,Seznam!$A$4:$K$500,3))","v":"Kozlovice"},{"$f":"IF($B19=\"\",\"\",VLOOKUP($B19,Seznam!$A$4:$K$500,4))","v":2005},1,null,null,null,null,null,1,1]
["13.",121,{"$f":"IF($B20=\"\",\"\",VLOOKUP($B20,Seznam!$A$4:$K$500,2))","v":"Kotajný Jakub"},{"$f":"IF($B20=\"\",\"\",VLOOKUP($B20,Seznam!$A$4:$K$500,3))","v":"Vendryně"},{"$f":"IF($B20=\"\",\"\",VLOOKUP($B20,Seznam!$A$4:$K$500,4))","v":2003},null,null,1,null,null,null,1,1]
["14.",98,{"$f":"IF($B21=\"\",\"\",VLOOKUP($B21,Seznam!$A$4:$K$500,2))","v":"Hamar Tomáš"},{"$f":"IF($B21=\"\",\"\",VLOOKUP($B21,Seznam!$A$4:$K$500,3))","v":"Brušperk"},{"$f":"IF($B21=\"\",\"\",VLOOKUP($B21,Seznam!$A$4:$K$500,4))","v":2004},null,null,null,1,null,null,1,1]
["15.",null,{"$f":"IF($B22=\"\",\"\",VLOOKUP($B22,Seznam!$A$4:$K$500,2))","v":""},{"$f":"IF($B22=\"\",\"\",VLOOKUP($B22,Seznam!$A$4:$K$500,3))","v":""},{"$f":"IF($B22=\"\",\"\",VLOOKUP($B22,Seznam!$A$4:$K$500,4))","v":""},null,null,null,null,null,null,"",0]
["16.",null,{"$f":"IF($B23=\"\",\"\",VLOOKUP($B23,Seznam!$A$4:$K$500,2))","v":""},{"$f":"IF($B23=\"\",\"\",VLOOKUP($B23,Seznam!$A$4:$K$500,3))","v":""},{"$f":"IF($B23=\"\",\"\",VLOOKUP($B23,Seznam!$A$4:$K$500,4))","v":""},null,null,null,null,null,null,"",0]
["17.",null,{"$f":"IF($B24=\"\",\"\",VLOOKUP($B24,Seznam!$A$4:$K$500,2))","v":""},{"$f":"IF($B24=\"\",\"\",VLOOKUP($B24,Seznam!$A$4:$K$500,3))","v":""},{"$f":"IF($B24=\"\",\"\",VLOOKUP($B24,Seznam!$A$4:$K$500,4))","v":""},null,null,null,null,null,null,"",0]
["18.",null,{"$f":"IF($B25=\"\",\"\",VLOOKUP($B25,Seznam!$A$4:$K$500,2))","v":""},{"$f":"IF($B25=\"\",\"\",VLOOKUP($B25,Seznam!$A$4:$K$500,3))","v":""},{"$f":"IF($B25=\"\",\"\",VLOOKUP($B25,Seznam!$A$4:$K$500,4))","v":""},null,null,null,null,null,null,"",0]
["19.",null,{"$f":"IF($B26=\"\",\"\",VLOOKUP($B26,Seznam!$A$4:$K$500,2))","v":""},{"$f":"IF($B26=\"\",\"\",VLOOKUP($B26,Seznam!$A$4:$K$500,3))","v":""},{"$f":"IF($B26=\"\",\"\",VLOOKUP($B26,Seznam!$A$4:$K$500,4))","v":""},null,null,null,null,null,null,"",0]
["20.",null,{"$f":"IF($B27=\"\",\"\",VLOOKUP($B27,Seznam!$A$4:$K$500,2))","v":""},{"$f":"IF($B27=\"\",\"\",VLOOKUP($B27,Seznam!$A$4:$K$500,3))","v":""},{"$f":"IF($B27=\"\",\"\",VLOOKUP($B27,Seznam!$A$4:$K$500,4))","v":""},null,null,null,null,null,null,"",0]
[21,null,{"$f":"IF($B28=\"\",\"\",VLOOKUP($B28,Seznam!$A$4:$K$500,2))","v":""},{"$f":"IF($B28=\"\",\"\",VLOOKUP($B28,Seznam!$A$4:$K$500,3))","v":""},{"$f":"IF($B28=\"\",\"\",VLOOKUP($B28,Seznam!$A$4:$K$500,4))","v":""},null,null,null,null,null,null,"",0]
["22.",null,{"$f":"IF($B29=\"\",\"\",VLOOKUP($B29,Seznam!$A$4:$K$500,2))","v":""},{"$f":"IF($B29=\"\",\"\",VLOOKUP($B29,Seznam!$A$4:$K$500,3))","v":""},{"$f":"IF($B29=\"\",\"\",VLOOKUP($B29,Seznam!$A$4:$K$500,4))","v":""},null,null,null,null,null,null,"",0]
[]
[null,null,"Starší žáci"]
["poř.","č.h.","jméno","oddíl/klub","nar.",{"$f":"F6","v":"Fryd."},"Brušp.","ČT","ČT","Fryd.",0,"počet turnajů","celkem      bodů"]
["1.",38,{"$f":"IF($B33=\"\",\"\",VLOOKUP($B33,Seznam!$A$4:$K$500,2))","v":"Zvrtek Jan"},{"$f":"IF($B33=\"\",\"\",VLOOKUP($B33,Seznam!$A$4:$K$500,3))","v":"Návsí"},{"$f":"IF($B33=\"\",\"\",VLOOKUP($B33,Seznam!$A$4:$K$500,4))","v":2004},null,null,5,5,null,null,{"$f":"IF(AND(J33=\"\",F33=\"\",G33=\"\",H33=\"\",I33=\"\",K33),\"\",COUNTA(F33:K33))","v":2},{"$f":"IF(B33=\"\",0,SUM(IF(ISERROR(LARGE(F33:K33,1)),0,LARGE(F33:K33,1)),IF(ISERROR(LARGE(F33:K33,2)),0,LARGE(F33:K33,2)),IF(ISERROR(LARGE(F33:K33,3)),0,LARGE(F33:K33,3)),IF(ISERROR(LARGE(F33:K33,4)),0,LARGE(F33:K33,4))))","v":10}]
["2.",27,{"$f":"IF($B34=\"\",\"\",VLOOKUP($B34,Seznam!$A$4:$K$500,2))","v":"Hýl Jakub"},{"$f":"IF($B34=\"\",\"\",VLOOKUP($B34,Seznam!$A$4:$K$500,3))","v":"Brušperk"},{"$f":"IF($B34=\"\",\"\",VLOOKUP($B34,Seznam!$A$4:$K$500,4))","v":2006},5,4,null,null,null,null,2,9]
["3.",95,{"$f":"IF($B35=\"\",\"\",VLOOKUP($B35,Seznam!$A$4:$K$500,2))","v":"Ondračka Adam"},{"$f":"IF($B35=\"\",\"\",VLOOKUP($B35,Seznam!$A$4:$K$500,3))","v":"Frýdlant"},{"$f":"IF($B35=\"\",\"\",VLOOKUP($B35,Seznam!$A$4:$K$500,4))","v":2007},4,null,4,null,null,null,2,8]
["4.",97,{"$f":"IF($B36=\"\",\"\",VLOOKUP($B36,Seznam!$A$4:$K$500,2))","v":"Bakota Adam"},{"$f":"IF($B36=\"\",\"\",VLOOKUP($B36,Seznam!$A$4:$K$500,3))","v":"Frýdlant"},{"$f":"IF($B36=\"\",\"\",VLOOKUP($B36,Seznam!$A$4:$K$500,4))","v":2006},null,3,3,null,null,null,2,6]
["5.",98,{"$f":"IF($B37=\"\",\"\",VLOOKUP($B37,Seznam!$A$4:$K$500,2))","v":"Hamar Tomáš"},{"$f":"IF($B37=\"\",\"\",VLOOKUP($B37,Seznam!$A$4:$K$500,3))","v":"Brušperk"},{"$f":"IF($B37=\"\",\"\",VLOOKUP($B37,Seznam!$A$4:$K$500,4))","v":2004},1,2,null,3,null,null,3,6]
["6.",20,{"$f":"IF($B38=\"\",\"\",VLOOKUP($B38,Seznam!$A$4:$K$500,2))","v":"Mrowetz Bruno"},{"$f":"IF($B38=\"\",\"\",VLOOKUP($B38,Seznam!$A$4:$K$500,3))","v":"Brušperk"},{"$f":"IF($B38=\"\",\"\",VLOOKUP($B38,Seznam!$A$4:$K$500,4))","v":2004},null,5,null,null,null,null,1,5]
["7.",138,{"$f":"IF($B39=\"\",\"\",VLOOKUP($B39,Seznam!$A$4:$K$500,2))","v":"Halfar Jan"},{"$f":"IF($B39=\"\",\"\",VLOOKUP($B39,Seznam!$A$4:$K$500,3))","v":"Český Těšín"},{"$f":"IF($B39=\"\",\"\",VLOOKUP($B39,Seznam!$A$4:$K$500,4))","v":2005},null,null,null,4,null,null,1,4]
["8.",9,{"$f":"IF($B40=\"\",\"\",VLOOKUP($B40,Seznam!$A$4:$K$500,2))","v":"Šlachta Prokop Antonín"},{"$f":"IF($B40=\"\",\"\",VLOOKUP($B40,Seznam!$A$4:$K$500,3))","v":"Frýdek - Místek"},{"$f":"IF($B40=\"\",\"\",VLOOKUP($B40,Seznam!$A$4:$K$500,4))","v":2006},3,null,null,null,null,null,1,3]
{"$rows_left_out":80}