{"text_format":"1","workbook":"xlsx","n_sheets":3,"sheets":["Seznam","průměrné umístění","průběžné bodové pořadí"],"not_rendered":{"charts":0,"images":0,"macros":1,"external_links":0,"defined_names":12,"comments":0,"pivot_tables":0},"unopened":[],"bounds":{"document_bytes":16777216,"sheet_cells":100000,"rows_first":2000,"rows_last":500,"rows_between":2000,"halvings":0,"cell_chars":16384,"cell_head_chars":4096},"cells_cut":0,"cells_raw":0,"read":"whole","date_system":"1900"}

{"sheet":"Seznam","index":0,"n_rows":203,"n_cols":4,"rows_kept":203,"cut":false,"hidden":false,"merged":[[0,0,0,3]]}
["Seznam hráčů OBTM Frýdek-Místek 2016-2017"]
[]
["č.h.","Jméno","oddílúklub","nar."]
[1,"Jančák Richard","Brušperk",2006]
[2,"Blahuta Petr","SK Frýdlant",2006]
[3,"Muroň Ondřej","TTC Frýdlant",2004]
[4,"Kozel Ladislav","TTC Frýdlant",2004]
[5,"Janečka Martin","Brušperk",2002]
[6,"Rybák Tomáš","SK Frýdlant",2006]
[7,"Pařil Ondřej","Kopřivnice",2003]
[8,"Kociánová Natálie","TTC Frýdlant",2009]
[9,"Šlachta Prokop Antonín","Frýdek - Místek",2006]
[10,"Kuchař Andrej","CDU Ostrava",2004]
[11,"Ščerbová Barbora","SK Frýdlant",2005]
[12,"Gavendová Andrea","CDU Ostrava",2006]
[13,"Neuwirth Jaroslav","Brušperk",2002]
[14,"Káňa Tomáš","SK Frýdlant",2007]
[15,"Rozkydalová Eliška","Frýdlant",2002]
[16,"Lasota Laurent","Lištná",2001]
[17,"Michnová Marika","SK Frýdlant",2008]
[18,"Kubala Patrik","SK Frýdlant",2001]
[19,"Přikryl Václav","TTC Frýdlant",2005]
[20,"Mrowetz Bruno","Brušperk",2004]
[21,"Dudková Jana","TTC Frýdlant",2007]
[22,"Byrtus David","Český Těšín",2004]
[23,"Voneš Otmar","Frýdlant",2006]
[24,"Břenek Jiří","Karviná",2009]
[25,"Smetana Jan","Třinec",2008]
[26,"Malyjurek David","Mosty u Jablunkova",2004]
[27,"Hýl Jakub","Brušperk",2006]
[28,"Domenyová Klára","Český Těšín",2003]
[29,"Karásek Kryštof","TTC Frýdlant",2005]
[30,"Olejník Oliver","TTC F-M",2011]
[31,"Strašák Filip","Třinec",2007]
[32,"Szotkowski Jan","Dolní Lomná",2003]
[33,"Lichna Matěj","Havířov",2006]
[34,"Kufa Radek","Jablunkov",2002]
[35,"Moravec Václav","Paskov",2008]
[36,"Slaný Vojtěch","Paskov",2005]
[37,"Huta Lukáš","Třinec",2006]
[38,"Zvrtek Jan","Návsí",2004]
[39,"Walek Adrian","Návsí",2005]
[40,"Pohanka Marek","Paskov",2001]
[41,"Břenková Kristýna","Karviná",2009]
[42,"Smolka Daniel","Kozlovice",2005]
[43,"Stávek Jan","Malenovice",2003]
[44,"Zvrtková Magdaléna","Návsí",2002]
[45,"Smetana Dominik","Ropice",2003]
[46,"Kotas Jakub","Třinec",2008]
[47,"Vorbis Michal","Paskov",2000]
[48,"Michna Viktor","Paskov",2004]
[49,"Bonek Daniel","TJ Sokol Nýdek",2004]
[50,"Kisiala David","Český Těšín",2006]
[51,"Svoboda Vojtěch","TTC F-M",2006]
[52,"Kunát Martin","Paskov",2003]
[53,"Pustka Adam ","Kozlovice",2008]
[54,"Fedorčík André","Frýdlant",2005]
[55,"Ševeček Jan","Brušperk",2005]
[56,"Stodůlková Tereza","SK Frýdlant",2008]
[57,"Novák Petr","TTC F-M",2006]
[58,"Chudíková Nikol","Komorní Lhotka",2007]
[59,"Szotkowski Jan","Třinec",2006]
[60,"Pilch Štěpán","Třinec",2007]
[61,"Šefl Josef","Brušperk",2006]
[62,"Neuwirth Ondřej","Brušperk",2006]
[63,"Jendrůlek Adam","Ropice",2003]
[64,"Tabach René","Kozlovice",2005]
[65,"Stramová Eliška","Frýdlant",2005]
[66,"Kožušník Lukáš","Frýdlant",2003]
[67,"Kozelský Teodor","Paskov",2005]
[68,"Janota Tomáš","Český Těšín",2005]
[69,"Kresta Matěj","Kozlovice",2005]
[70,"Mitrenga Jan","TJ Sokol Nýdek",2007]
[71,"Lisztwán Jan","Vendryně",2005]
[72,"Kowalowski Lukáš","Jablunkov",2003]
[73,"Pščolka Michael","Vendryně",2005]
[74,"Somr Daniel","Frýdlant",2007]
[75,"Duda Lukáš","Návsí",2001]
[76,"Vantuch Richard","Brušperk",2009]
[77,"Vojta Ondřej","Ropice",2003]
[78,"Brozda David","Ropice",2005]
[79,"Červenka Jan","Brušperk",2004]
[80,"Michenka Ivo","Paskov",2002]
[81,"Dudys Viktor","Vendryně",2008]
[82,"Pánek Jakub","Kozlovice",2005]
[83,"Tikal Tobiáš","TTC F-M",2008]
[84,"Šrámková Tereza","Frýdlant",2006]
[85,"Slaný Martin","Paskov",2008]
[86,"Fajkus Milan","Frýdlant",2005]
[87,"Kresta Filip","Frýdlant",2007]
[88,"Nitrová Valerie","Frýdlant",2007]
[89,"Šnajder Jakub","Frýdlant",2004]
[90,"Groman Marie","Frýdlant",2007]
[91,"Franěk Ondřej","Frýdlant",2005]
[92,"Papíková Elizabeth","Frýdlant",2006]
[93,"Hampl Vojtěch","Frýdlant",2008]
[94,"Turek Josef","Dolní Lomná",2001]
[95,"Ondračka Adam","Frýdlant",2007]
[96,"Vašek Lukáš","Frýdlant",2006]
[97,"Bakota Adam","Frýdlant",2006]
[98,"Hamar Tomáš","Brušperk",2004]
[99,"Šrámková Daniela","Frýdlant",2005]
[100,"Jakubíková Nela","Kozlovice",2006]
[101,"Pánková Tereza","Kozlovice",2007]
[102,"Petrů Matouš","Kozlovice",2006]
[103,"Dostál Piotr","Ropice",2005]
[104,"Škandera Vojtěch","Dolní Lomná",2004]
[105,"Martynek Filip","Dolní Lomná",2003]
[106,"Gluza Jan","Třinec",2005]
[107,"Jokiel Patrik","Český Těšín",2001]
[108,"Danemark Roman","Ropice",2004]
[109,"Herman Ondřej","KST Ostrava",2008]
[110,"Fuchsík Šimon","Frýdlant",2008]
[111,"Jílková Tereza","Frýdlant",2008]
[112,"Onderek Martin","Frýdlant",2008]
[113,"Molek Matěj","Frýdlant",2006]
[114,"Molek Martin","Frýdlant",2009]
[115,"Foldyna Robin","Frýdlant",2003]
[116,"Michenka Ivo","Paskov",2002]
[117,"Sedlařík Leo","Paskov",2003]
[118,"Krucina Vojtěch","TJ Sokol Nýdek",2005]
[119,"Szturc Ondřej","Vendryně",2004]
[120,"Dvořáková Gábina","CDU Ostrava",2006]
[121,"Kotajný Jakub","Vendryně",2003]
[122,"Brož Jan","Brušperk",2006]
[123,"Kočvara Lukáš","CDU Ostrava",2006]
[124,"Mlčoch Jan","CDU Ostrava",2008]
[125,"Fabián Tobiáš","TTC F-M",2011]
[126,"Kulštejn Ondřej","Návsí",2005]
[127,"Voloch Jiří","CDU Ostrava",2004]
[128,"Svoboda Vojtěch","TTC F-M",2006]
[129,"Staněk Michael","Chotěbuz",2003]
[130,"Pavlowski Vít","Chotěbuz",2001]
[131,"Kubiena Roman","Chotěbuz",2004]
[132,"Heczko David","Návsí",2007]
[133,"Vajda Ondřej","Brušperk",2005]
[134,"Viňanský Pavel","Brušperk",2008]
[135,"Blahuta Petr","Frýdlant",2006]
[136,"Špaček Michal","Brušperk",2007]
[137,"Přeček Erik","škola p-p Ostrava",2007]
[138,"Halfar Jan","Český Těšín",2005]
[139,"Kyselý Štěpán","Mořkov",2004]
[140,"Kyselý Ondřej","Mořkov",2007]
[141,"Pajma Petr","Paskov",2004]
[142,"Kotas Jakub","Třinec",2008]
[143,"Macíček Jan","Mořkov",2004]
[144,"Kaiser František","SK Frýdlant",2005]
[145,"Dmytruch Michal","SK Frýdlant",2001]
[146,"Polášek Daniel","SK Frýdlant",2007]
[147,"Michna Oskar","Paskov",2007]
[148,"Bortel Kryštof","CDU Ostrava",2009]
[149,"Menšík Martin","SK Frýdlant",2010]
[150,"Filip Matouš","SK Frýdlant",2010]
[151,"Ježovič Jan","Český Těšín",2005]
[152,"Mniszak Lukáš","Frýdlant",2004]
[153,"Kocián Vojtěch","Brušperk",2006]
[154,"Brudný Sebastián","Český Těšín",2008]
[155,"Stavarský Jakub","Český Těšín",2006]
[156,"Hrabovský Adam","Brušperk",2006]
[157,"Zvrtek Lukáš","Třinec",2007]
[158,"Tomalík Ondřej","TTC Frýdlant",2009]
[159,"Kajfosz Jakub","Třinec",2006]
[160,"Pánek Michal","Český Těšín",2007]
[161,"Lepík František","Kozlovice",2008]
[162,"Žáček Jakub","Kozlovice",2008]
[163,"Vitt Tomáš","Kozlovice",2008]
[164,"Rakowski Jan","Třinec",2006]
[165,"Turek Dalibor","?","?"]
[166]
[167]
[168]
[169]
[170]
[171]
[172]
[173]
[174]
[175]
[176]
[177]
[178]
[179]
[180]
[181]
[182]
[183]
[184]
[185]
[186]
[187]
[188]
[189]
[190]
[191]
[192]
[193]
[194]
[195]
[196]
[197]
[198]
[199]
[200]

{"sheet":"průměrné umístění","index":1,"n_rows":154,"n_cols":13,"rows_kept":154,"cut":false,"hidden":false,"merged":[[0,1,0,12],[0,24,0,28],[1,18,1,22],[1,24,1,28]]}
[null,"NASAZOVACÍ  ŽEBŘÍČEK  NA  ZÁKLADĚ  PRŮMĚRNÉHO  UMÍSTĚNÍ"]
[]
[null,null,null,null,null,null,1,2,3,4,5]
["poř.","č.h.","Jméno","oddíl/klub","nar.","průměr 2017/2018","Frýdlant","Brušperk","ČT","ČT",null,"počet turnajů + výchozí pořadí","průměrné umístění"]
[1,59,{"$f":"IF($B5=\"\",\"\",VLOOKUP($B5,Seznam!$A$4:$D$500,2))","v":"Szotkowski Jan"},{"$f":"IF($B5=\"\",\"\",VLOOKUP($B5,Seznam!$A$4:$D$500,3))","v":"Třinec"},{"$f":"IF($B5=\"\",\"\",VLOOKUP($B5,Seznam!$A$4:$D$500,4))","v":2006},2,null,null,1,1,null,{"$f":"IF(AND(F5=\"\",G5=\"\",H5=\"\",I5=\"\",J5=\"\",K5=\"\"),\"\",COUNTA(F5:K5))","v":3},{"$f":"IF(OR(F5>0,G5>0,H5>0,I5>0,J5>0,K5>0),ROUNDUP(SUM(F5:K5)/L5,1),\"\")","v":1.4000000000000001}]
[2,13,{"$f":"IF($B6=\"\",\"\",VLOOKUP($B6,Seznam!$A$4:$D$500,2))","v":"Neuwirth Jaroslav"},{"$f":"IF($B6=\"\",\"\",VLOOKUP($B6,Seznam!$A$4:$D$500,3))","v":"Brušperk"},{"$f":"IF($B6=\"\",\"\",VLOOKUP($B6,Seznam!$A$4:$D$500,4))","v":2002},2.6,1,3,null,null,null,3,2.2000000000000002]
[3,20,{"$f":"IF($B7=\"\",\"\",VLOOKUP($B7,Seznam!$A$4:$D$500,2))","v":"Mrowetz Bruno"},{"$f":"IF($B7=\"\",\"\",VLOOKUP($B7,Seznam!$A$4:$D$500,3))","v":"Brušperk"},{"$f":"IF($B7=\"\",\"\",VLOOKUP($B7,Seznam!$A$4:$D$500,4))","v":2004},3.5,null,1,null,null,null,2,2.3000000000000003]
[4,16,{"$f":"IF($B8=\"\",\"\",VLOOKUP($B8,Seznam!$A$4:$D$500,2))","v":"Lasota Laurent"},{"$f":"IF($B8=\"\",\"\",VLOOKUP($B8,Seznam!$A$4:$D$500,3))","v":"Lištná"},{"$f":"IF($B8=\"\",\"\",VLOOKUP($B8,Seznam!$A$4:$D$500,4))","v":2001},2.5,null,null,null,null,null,1,2.5]
[5,5,{"$f":"IF($B9=\"\",\"\",VLOOKUP($B9,Seznam!$A$4:$D$500,2))","v":"Janečka Martin"},{"$f":"IF($B9=\"\",\"\",VLOOKUP($B9,Seznam!$A$4:$D$500,3))","v":"Brušperk"},{"$f":"IF($B9=\"\",\"\",VLOOKUP($B9,Seznam!$A$4:$D$500,4))","v":2002},3.9,null,2,null,null,null,2,3]
[6,107,{"$f":"IF($B10=\"\",\"\",VLOOKUP($B10,Seznam!$A$4:$D$500,2))","v":"Jokiel Patrik"},{"$f":"IF($B10=\"\",\"\",VLOOKUP($B10,Seznam!$A$4:$D$500,3))","v":"Český Těšín"},{"$f":"IF($B10=\"\",\"\",VLOOKUP($B10,Seznam!$A$4:$D$500,4))","v":2001},null,null,null,6,3,null,2,4.5]
[7,27,{"$f":"IF($B11=\"\",\"\",VLOOKUP($B11,Seznam!$A$4:$D$500,2))","v":"Hýl Jakub"},{"$f":"IF($B11=\"\",\"\",VLOOKUP($B11,Seznam!$A$4:$D$500,3))","v":"Brušperk"},{"$f":"IF($B11=\"\",\"\",VLOOKUP($B11,Seznam!$A$4:$D$500,4))","v":2006},9.7999999999999989,2,4,null,null,null,3,5.3]
[8,71,{"$f":"IF($B12=\"\",\"\",VLOOKUP($B12,Seznam!$A$4:$D$500,2))","v":"Lisztwán Jan"},{"$f":"IF($B12=\"\",\"\",VLOOKUP($B12,Seznam!$A$4:$D$500,3))","v":"Vendryně"},{"$f":"IF($B12=\"\",\"\",VLOOKUP($B12,Seznam!$A$4:$D$500,4))","v":2005},5.6999999999999993,null,null,null,null,null,1,5.7]
[9,36,{"$f":"IF($B13=\"\",\"\",VLOOKUP($B13,Seznam!$A$4:$D$500,2))","v":"Slaný Vojtěch"},{"$f":"IF($B13=\"\",\"\",VLOOKUP($B13,Seznam!$A$4:$D$500,3))","v":"Paskov"},{"$f":"IF($B13=\"\",\"\",VLOOKUP($B13,Seznam!$A$4:$D$500,4))","v":2005},6.3,null,null,null,null,null,1,6.3]
[10,38,{"$f":"IF($B14=\"\",\"\",VLOOKUP($B14,Seznam!$A$4:$D$500,2))","v":"Zvrtek Jan"},{"$f":"IF($B14=\"\",\"\",VLOOKUP($B14,Seznam!$A$4:$D$500,3))","v":"Návsí"},{"$f":"IF($B14=\"\",\"\",VLOOKUP($B14,Seznam!$A$4:$D$500,4))","v":2004},null,null,17,2,2,null,3,7]
[11,97,{"$f":"IF($B15=\"\",\"\",VLOOKUP($B15,Seznam!$A$4:$D$500,2))","v":"Bakota Adam"},{"$f":"IF($B15=\"\",\"\",VLOOKUP($B15,Seznam!$A$4:$D$500,3))","v":"Frýdlant"},{"$f":"IF($B15=\"\",\"\",VLOOKUP($B15,Seznam!$A$4:$D$500,4))","v":2006},12.299999999999999,null,5,4,null,null,3,7.1]
[12,138,{"$f":"IF($B16=\"\",\"\",VLOOKUP($B16,Seznam!$A$4:$D$500,2))","v":"Halfar Jan"},{"$f":"IF($B16=\"\",\"\",VLOOKUP($B16,Seznam!$A$4:$D$500,3))","v":"Český Těšín"},{"$f":"IF($B16=\"\",\"\",VLOOKUP($B16,Seznam!$A$4:$D$500,4))","v":2005},null,null,null,11,4,null,2,7.5]
[13,43,{"$f":"IF($B17=\"\",\"\",VLOOKUP($B17,Seznam!$A$4:$D$500,2))","v":"Stávek Jan"},{"$f":"IF($B17=\"\",\"\",VLOOKUP($B17,Seznam!$A$4:$D$500,3))","v":"Malenovice"},{"$f":"IF($B17=\"\",\"\",VLOOKUP($B17,Seznam!$A$4:$D$500,4))","v":2003},7.8999999999999995,null,null,null,null,null,1,7.9]
[14,40,{"$f":"IF($B18=\"\",\"\",VLOOKUP($B18,Seznam!$A$4:$D$500,2))","v":"Pohanka Marek"},{"$f":"IF($B18=\"\",\"\",VLOOKUP($B18,Seznam!$A$4:$D$500,3))","v":"Paskov"},{"$f":"IF($B18=\"\",\"\",VLOOKUP($B18,Seznam!$A$4:$D$500,4))","v":2001},9.8000000000000007,null,6,null,null,null,2,7.9]
[15,95,{"$f":"IF($B19=\"\",\"\",VLOOKUP($B19,Seznam!$A$4:$D$500,2))","v":"Ondračka Adam"},{"$f":"IF($B19=\"\",\"\",VLOOKUP($B19,Seznam!$A$4:$D$500,3))","v":"Frýdlant"},{"$f":"IF($B19=\"\",\"\",VLOOKUP($B19,Seznam!$A$4:$D$500,4))","v":2007},18,3,null,3,null,null,3,8]
[16,121,{"$f":"IF($B20=\"\",\"\",VLOOKUP($B20,Seznam!$A$4:$D$500,2))","v":"Kotajný Jakub"},{"$f":"IF($B20=\"\",\"\",VLOOKUP($B20,Seznam!$A$4:$D$500,3))","v":"Vendryně"},{"$f":"IF($B20=\"\",\"\",VLOOKUP($B20,Seznam!$A$4:$D$500,4))","v":2003},11,null,null,5,null,null,2,8]
[17,75,{"$f":"IF($B21=\"\",\"\",VLOOKUP($B21,Seznam!$A$4:$D$500,2))","v":"Duda Lukáš"},{"$f":"IF($B21=\"\",\"\",VLOOKUP($B21,Seznam!$A$4:$D$500,3))","v":"Návsí"},{"$f":"IF($B21=\"\",\"\",VLOOKUP($B21,Seznam!$A$4:$D$500,4))","v":2001},null,null,null,8,null,null,1,8]
[18,94,{"$f":"IF($B22=\"\",\"\",VLOOKUP($B22,Seznam!$A$4:$D$500,2))","v":"Turek Josef"},{"$f":"IF($B22=\"\",\"\",VLOOKUP($B22,Seznam!$A$4:$D$500,3))","v":"Dolní Lomná"},{"$f":"IF($B22=\"\",\"\",VLOOKUP($B22,Seznam!$A$4:$D$500,4))","v":2001},null,null,null,9,7,null,2,8]
[19,98,{"$f":"IF($B23=\"\",\"\",VLOOKUP($B23,Seznam!$A$4:$D$500,2))","v":"Hamar Tomáš"},{"$f":"IF($B23=\"\",\"\",VLOOKUP($B23,Seznam!$A$4:$D$500,3))","v":"Brušperk"},{"$f":"IF($B23=\"\",\"\",VLOOKUP($B23,Seznam!$A$4:$D$500,4))","v":2004},15.6,6,7,null,5,null,4,8.4]
[20,129,{"$f":"IF($B24=\"\",\"\",VLOOKUP($B24,Seznam!$A$4:$D$500,2))","v":"Staněk Michael"},{"$f":"IF($B24=\"\",\"\",VLOOKUP($B24,Seznam!$A$4:$D$500,3))","v":"Chotěbuz"},{"$f":"IF($B24=\"\",\"\",VLOOKUP($B24,Seznam!$A$4:$D$500,4))","v":2003},null,null,null,null,9,null,1,9]
[21,48,{"$f":"IF($B25=\"\",\"\",VLOOKUP($B25,Seznam!$A$4:$D$500,2))","v":"Michna Viktor"},{"$f":"IF($B25=\"\",\"\",VLOOKUP($B25,Seznam!$A$4:$D$500,3))","v":"Paskov"},{"$f":"IF($B25=\"\",\"\",VLOOKUP($B25,Seznam!$A$4:$D$500,4))","v":2004},12.2,7,null,null,8,null,3,9.1]
[22,82,{"$f":"IF($B26=\"\",\"\",VLOOKUP($B26,Seznam!$A$4:$D$500,2))","v":"Pánek Jakub"},{"$f":"IF($B26=\"\",\"\",VLOOKUP($B26,Seznam!$A$4:$D$500,3))","v":"Kozlovice"},{"$f":"IF($B26=\"\",\"\",VLOOKUP($B26,Seznam!$A$4:$D$500,4))","v":2005},16.7,5,8,null,null,null,3,9.9]
[23,33,{"$f":"IF($B27=\"\",\"\",VLOOKUP($B27,Seznam!$A$4:$D$500,2))","v":"Lichna Matěj"},{"$f":"IF($B27=\"\",\"\",VLOOKUP($B27,Seznam!$A$4:$D$500,3))","v":"Havířov"},{"$f":"IF($B27=\"\",\"\",VLOOKUP($B27,Seznam!$A$4:$D$500,4))","v":2006},11.7,null,null,null,null,null,1,11.7]
[24,64,{"$f":"IF($B28=\"\",\"\",VLOOKUP($B28,Seznam!$A$4:$D$500,2))","v":"Tabach René"},{"$f":"IF($B28=\"\",\"\",VLOOKUP($B28,Seznam!$A$4:$D$500,3))","v":"Kozlovice"},{"$f":"IF($B28=\"\",\"\",VLOOKUP($B28,Seznam!$A$4:$D$500,4))","v":2005},11.7,null,null,null,null,null,1,11.7]
[25,55,{"$f":"IF($B29=\"\",\"\",VLOOKUP($B29,Seznam!$A$4:$D$500,2))","v":"Ševeček Jan"},{"$f":"IF($B29=\"\",\"\",VLOOKUP($B29,Seznam!$A$4:$D$500,3))","v":"Brušperk"},{"$f":"IF($B29=\"\",\"\",VLOOKUP($B29,Seznam!$A$4:$D$500,4))","v":2005},17.3,8,10,null,null,null,3,11.799999999999999]
[26,9,{"$f":"IF($B30=\"\",\"\",VLOOKUP($B30,Seznam!$A$4:$D$500,2))","v":"Šlachta Prokop Antonín"},{"$f":"IF($B30=\"\",\"\",VLOOKUP($B30,Seznam!$A$4:$D$500,3))","v":"Frýdek - Místek"},{"$f":"IF($B30=\"\",\"\",VLOOKUP($B30,Seznam!$A$4:$D$500,4))","v":2006},20.3,4,null,null,null,null,2,12.2]
[27,39,{"$f":"IF($B31=\"\",\"\",VLOOKUP($B31,Seznam!$A$4:$D$500,2))","v":"Walek Adrian"},{"$f":"IF($B31=\"\",\"\",VLOOKUP($B31,Seznam!$A$4:$D$500,3))","v":"Návsí"},{"$f":"IF($B31=\"\",\"\",VLOOKUP($B31,Seznam!$A$4:$D$500,4))","v":2005},null,null,18,7,null,null,2,12.5]
[28,65,{"$f":"IF($B32=\"\",\"\",VLOOKUP($B32,Seznam!$A$4:$D$500,2))","v":"Stramová Eliška"},{"$f":"IF($B32=\"\",\"\",VLOOKUP($B32,Seznam!$A$4:$D$500,3))","v":"Frýdlant"},{"$f":"IF($B32=\"\",\"\",VLOOKUP($B32,Seznam!$A$4:$D$500,4))","v":2005},22,9,9,10,null,null,4,12.5]
[29,62,{"$f":"IF($B33=\"\",\"\",VLOOKUP($B33,Seznam!$A$4:$D$500,2))","v":"Neuwirth Ondřej"},{"$f":"IF($B33=\"\",\"\",VLOOKUP($B33,Seznam!$A$4:$D$500,3))","v":"Brušperk"},{"$f":"IF($B33=\"\",\"\",VLOOKUP($B33,Seznam!$A$4:$D$500,4))","v":2006},20.5,10,11,12,10,null,5,12.7]
[30,63,{"$f":"IF($B34=\"\",\"\",VLOOKUP($B34,Seznam!$A$4:$D$500,2))","v":"Jendrůlek Adam"},{"$f":"IF($B34=\"\",\"\",VLOOKUP($B34,Seznam!$A$4:$D$500,3))","v":"Ropice"},{"$f":"IF($B34=\"\",\"\",VLOOKUP($B34,Seznam!$A$4:$D$500,4))","v":2003},13,null,null,null,null,null,1,13]
[31,10,{"$f":"IF($B35=\"\",\"\",VLOOKUP($B35,Seznam!$A$4:$D$500,2))","v":"Kuchař Andrej"},{"$f":"IF($B35=\"\",\"\",VLOOKUP($B35,Seznam!$A$4:$D$500,3))","v":"CDU Ostrava"},{"$f":"IF($B35=\"\",\"\",VLOOKUP($B35,Seznam!$A$4:$D$500,4))","v":2004},13.5,null,null,null,null,null,1,13.5]
[32,3,{"$f":"IF($B36=\"\",\"\",VLOOKUP($B36,Seznam!$A$4:$D$500,2))","v":"Muroň Ondřej"},{"$f":"IF($B36=\"\",\"\",VLOOKUP($B36,Seznam!$A$4:$D$500,3))","v":"TTC Frýdlant"},{"$f":"IF($B36=\"\",\"\",VLOOKUP($B36,Seznam!$A$4:$D$500,4))","v":2004},19,null,14,15,13,null,4,15.299999999999999]
[33,17,{"$f":"IF($B37=\"\",\"\",VLOOKUP($B37,Seznam!$A$4:$D$500,2))","v":"Michnová Marika"},{"$f":"IF($B37=\"\",\"\",VLOOKUP($B37,Seznam!$A$4:$D$500,3))","v":"SK Frýdlant"},{"$f":"IF($B37=\"\",\"\",VLOOKUP($B37,Seznam!$A$4:$D$500,4))","v":2008},24,12,15,null,11,null,{"$f":"IF(AND(F37=\"\",G37=\"\",H37=\"\",I37=\"\",J37=\"\",K37=\"\"),\"\",COUNTA(F37:K37))","v":4},{"$f":"IF(OR(F37>0,G37>0,H37>0,I37>0,J37>0,K37>0),ROUNDUP(SUM(F37:K37)/L37,1),\"\")","v":15.5}]
[34,79,{"$f":"IF($B38=\"\",\"\",VLOOKUP($B38,Seznam!$A$4:$D$500,2))","v":"Červenka Jan"},{"$f":"IF($B38=\"\",\"\",VLOOKUP($B38,Seznam!$A$4:$D$500,3))","v":"Brušperk"},{"$f":"IF($B38=\"\",\"\",VLOOKUP($B38,Seznam!$A$4:$D$500,4))","v":2004},20.8,null,13,13,null,null,3,15.6]
[35,35,{"$f":"IF($B39=\"\",\"\",VLOOKUP($B39,Seznam!$A$4:$D$500,2))","v":"Moravec Václav"},{"$f":"IF($B39=\"\",\"\",VLOOKUP($B39,Seznam!$A$4:$D$500,3))","v":"Paskov"},{"$f":"IF($B39=\"\",\"\",VLOOKUP($B39,Seznam!$A$4:$D$500,4))","v":2008},15.7,null,null,null,null,null,1,15.7]
[36,2,{"$f":"IF($B40=\"\",\"\",VLOOKUP($B40,Seznam!$A$4:$D$500,2))","v":"Blahuta Petr"},{"$f":"IF($B40=\"\",\"\",VLOOKUP($B40,Seznam!$A$4:$D$500,3))","v":"SK Frýdlant"},{"$f":"IF($B40=\"\",\"\",VLOOKUP($B40,Seznam!$A$4:$D$500,4))","v":2006},17,null,null,null,null,null,1,17]
[37,139,{"$f":"IF($B41=\"\",\"\",VLOOKUP($B41,Seznam!$A$4:$D$500,2))","v":"Kyselý Štěpán"},{"$f":"IF($B41=\"\",\"\",VLOOKUP($B41,Seznam!$A$4:$D$500,3))","v":"Mořkov"},{"$f":"IF($B41=\"\",\"\",VLOOKUP($B41,Seznam!$A$4:$D$500,4))","v":2004},null,17,null,null,null,null,1,17]
[38,118,{"$f":"IF($B42=\"\",\"\",VLOOKUP($B42,Seznam!$A$4:$D$500,2))","v":"Krucina Vojtěch"},{"$f":"IF($B42=\"\",\"\",VLOOKUP($B42,Seznam!$A$4:$D$500,3))","v":"TJ Sokol Nýdek"},{"$f":"IF($B42=\"\",\"\",VLOOKUP($B42,Seznam!$A$4:$D$500,4))","v":2005},28,null,null,17,6,null,3,17]
[39,19,{"$f":"IF($B43=\"\",\"\",VLOOKUP($B43,Seznam!$A$4:$D$500,2))","v":"Přikryl Václav"},{"$f":"IF($B43=\"\",\"\",VLOOKUP($B43,Seznam!$A$4:$D$500,3))","v":"TTC Frýdlant"},{"$f":"IF($B43=\"\",\"\",VLOOKUP($B43,Seznam!$A$4:$D$500,4))","v":2005},29,15,12,null,12,null,4,17]
[40,45,{"$f":"IF($B44=\"\",\"\",VLOOKUP($B44,Seznam!$A$4:$D$500,2))","v":"Smetana Dominik"},{"$f":"IF($B44=\"\",\"\",VLOOKUP($B44,Seznam!$A$4:$D$500,3))","v":"Ropice"},{"$f":"IF($B44=\"\",\"\",VLOOKUP($B44,Seznam!$A$4:$D$500,4))","v":2003},17.399999999999999,null,null,null,null,null,1,17.399999999999999]
[41,4,{"$f":"IF($B45=\"\",\"\",VLOOKUP($B45,Seznam!$A$4:$D$500,2))","v":"Kozel Ladislav"},{"$f":"IF($B45=\"\",\"\",VLOOKUP($B45,Seznam!$A$4:$D$500,3))","v":"TTC Frýdlant"},{"$f":"IF($B45=\"\",\"\",VLOOKUP($B45,Seznam!$A$4:$D$500,4))","v":2004},20,null,16,16,null,null,3,17.400000000000002]
[42,56,{"$f":"IF($B46=\"\",\"\",VLOOKUP($B46,Seznam!$A$4:$D$500,2))","v":"Stodůlková Tereza"},{"$f":"IF($B46=\"\",\"\",VLOOKUP($B46,Seznam!$A$4:$D$500,3))","v":"SK Frýdlant"},{"$f":"IF($B46=\"\",\"\",VLOOKUP($B46,Seznam!$A$4:$D$500,4))","v":2008},19.5,null,null,null,16,null,2,17.8]
[43,85,{"$f":"IF($B47=\"\",\"\",VLOOKUP($B47,Seznam!$A$4:$D$500,2))","v":"Slaný Martin"},{"$f":"IF($B47=\"\",\"\",VLOOKUP($B47,Seznam!$A$4:$D$500,3))","v":"Paskov"},{"$f":"IF($B47=\"\",\"\",VLOOKUP($B47,Seznam!$A$4:$D$500,4))","v":2008},17.899999999999999,null,null,null,null,null,1,17.899999999999999]
[44,42,{"$f":"IF($B48=\"\",\"\",VLOOKUP($B48,Seznam!$A$4:$D$500,2))","v":"Smolka Daniel"},{"$f":"IF($B48=\"\",\"\",VLOOKUP($B48,Seznam!$A$4:$D$500,3))","v":"Kozlovice"},{"$f":"IF($B48=\"\",\"\",VLOOKUP($B48,Seznam!$A$4:$D$500,4))","v":2005},18,null,null,null,null,null,1,18]
[45,140,{"$f":"IF($B49=\"\",\"\",VLOOKUP($B49,Seznam!$A$4:$D$500,2))","v":"Kyselý Ondřej"},{"$f":"IF($B49=\"\",\"\",VLOOKUP($B49,Seznam!$A$4:$D$500,3))","v":"Mořkov"},{"$f":"IF($B49=\"\",\"\",VLOOKUP($B49,Seznam!$A$4:$D$500,4))","v":2007},null,18,null,null,null,null,1,18]
[46,52,{"$f":"IF($B50=\"\",\"\",VLOOKUP($B50,Seznam!$A$4:$D$500,2))","v":"Kunát Martin"},{"$f":"IF($B50=\"\",\"\",VLOOKUP($B50,Seznam!$A$4:$D$500,3))","v":"Paskov"},{"$f":"IF($B50=\"\",\"\",VLOOKUP($B50,Seznam!$A$4:$D$500,4))","v":2003},18.399999999999999,null,null,null,null,null,1,18.399999999999999]
[47,58,{"$f":"IF($B51=\"\",\"\",VLOOKUP($B51,Seznam!$A$4:$D$500,2))","v":"Chudíková Nikol"},{"$f":"IF($B51=\"\",\"\",VLOOKUP($B51,Seznam!$A$4:$D$500,3))","v":"Komorní Lhotka"},{"$f":"IF($B51=\"\",\"\",VLOOKUP($B51,Seznam!$A$4:$D$500,4))","v":2007},null,null,null,22,15,null,2,18.5]
[48,132,{"$f":"IF($B52=\"\",\"\",VLOOKUP($B52,Seznam!$A$4:$D$500,2))","v":"Heczko David"},{"$f":"IF($B52=\"\",\"\",VLOOKUP($B52,Seznam!$A$4:$D$500,3))","v":"Návsí"},{"$f":"IF($B52=\"\",\"\",VLOOKUP($B52,Seznam!$A$4:$D$500,4))","v":2007},null,null,null,19,null,null,1,19]
[49,120,{"$f":"IF($B53=\"\",\"\",VLOOKUP($B53,Seznam!$A$4:$D$500,2))","v":"Dvořáková Gábina"},{"$f":"IF($B53=\"\",\"\",VLOOKUP($B53,Seznam!$A$4:$D$500,3))","v":"CDU Ostrava"},{"$f":"IF($B53=\"\",\"\",VLOOKUP($B53,Seznam!$A$4:$D$500,4))","v":2006},28,11,null,null,null,null,2,19.5]
[50,49,{"$f":"IF($B54=\"\",\"\",VLOOKUP($B54,Seznam!$A$4:$D$500,2))","v":"Bonek Daniel"},{"$f":"IF($B54=\"\",\"\",VLOOKUP($B54,Seznam!$A$4:$D$500,3))","v":"TJ Sokol Nýdek"},{"$f":"IF($B54=\"\",\"\",VLOOKUP($B54,Seznam!$A$4:$D$500,4))","v":2004},27,null,null,18,14,null,3,19.700000000000003]
[51,126,{"$f":"IF($B55=\"\",\"\",VLOOKUP($B55,Seznam!$A$4:$D$500,2))","v":"Kulštejn Ondřej"},{"$f":"IF($B55=\"\",\"\",VLOOKUP($B55,Seznam!$A$4:$D$500,3))","v":"Návsí"},{"$f":"IF($B55=\"\",\"\",VLOOKUP($B55,Seznam!$A$4:$D$500,4))","v":2005},null,null,null,20,null,null,1,20]
[52,30,{"$f":"IF($B56=\"\",\"\",VLOOKUP($B56,Seznam!$A$4:$D$500,2))","v":"Olejník Oliver"},{"$f":"IF($B56=\"\",\"\",VLOOKUP($B56,Seznam!$A$4:$D$500,3))","v":"TTC F-M"},{"$f":"IF($B56=\"\",\"\",VLOOKUP($B56,Seznam!$A$4:$D$500,4))","v":2011},28.700000000000003,13,null,null,null,null,2,20.900000000000002]
[53,81,{"$f":"IF($B57=\"\",\"\",VLOOKUP($B57,Seznam!$A$4:$D$500,2))","v":"Dudys Viktor"},{"$f":"IF($B57=\"\",\"\",VLOOKUP($B57,Seznam!$A$4:$D$500,3))","v":"Vendryně"},{"$f":"IF($B57=\"\",\"\",VLOOKUP($B57,Seznam!$A$4:$D$500,4))","v":2008},21,null,null,null,null,null,1,21]
[54,6,{"$f":"IF($B58=\"\",\"\",VLOOKUP($B58,Seznam!$A$4:$D$500,2))","v":"Rybák Tomáš"},{"$f":"IF($B58=\"\",\"\",VLOOKUP($B58,Seznam!$A$4:$D$500,3))","v":"SK Frýdlant"},{"$f":"IF($B58=\"\",\"\",VLOOKUP($B58,Seznam!$A$4:$D$500,4))","v":2006},21,null,null,null,null,null,1,21]
[55,44,{"$f":"IF($B59=\"\",\"\",VLOOKUP($B59,Seznam!$A$4:$D$500,2))","v":"Zvrtková Magdaléna"},{"$f":"IF($B59=\"\",\"\",VLOOKUP($B59,Seznam!$A$4:$D$500,3))","v":"Návsí"},{"$f":"IF($B59=\"\",\"\",VLOOKUP($B59,Seznam!$A$4:$D$500,4))","v":2002},null,null,null,21,null,null,1,21]
[56,130,{"$f":"IF($B60=\"\",\"\",VLOOKUP($B60,Seznam!$A$4:$D$500,2))","v":"Pavlowski Vít"},{"$f":"IF($B60=\"\",\"\",VLOOKUP($B60,Seznam!$A$4:$D$500,3))","v":"Chotěbuz"},{"$f":"IF($B60=\"\",\"\",VLOOKUP($B60,Seznam!$A$4:$D$500,4))","v":2001},26,null,null,null,17,null,2,21.5]
[57,109,{"$f":"IF($B61=\"\",\"\",VLOOKUP($B61,Seznam!$A$4:$D$500,2))","v":"Herman Ondřej"},{"$f":"IF($B61=\"\",\"\",VLOOKUP($B61,Seznam!$A$4:$D$500,3))","v":"KST Ostrava"},{"$f":"IF($B61=\"\",\"\",VLOOKUP($B61,Seznam!$A$4:$D$500,4))","v":2008},22,null,null,null,null,null,1,22]
[58,133,{"$f":"IF($B62=\"\",\"\",VLOOKUP($B62,Seznam!$A$4:$D$500,2))","v":"Vajda Ondřej"},{"$f":"IF($B62=\"\",\"\",VLOOKUP($B62,Seznam!$A$4:$D$500,3))","v":"Brušperk"},{"$f":"IF($B62=\"\",\"\",VLOOKUP($B62,Seznam!$A$4:$D$500,4))","v":2005},33,19,22,14,null,null,4,22]
[59,141,{"$f":"IF($B63=\"\",\"\",VLOOKUP($B63,Seznam!$A$4:$D$500,2))","v":"Pajma Petr"},{"$f":"IF($B63=\"\",\"\",VLOOKUP($B63,Seznam!$A$4:$D$500,3))","v":"Paskov"},{"$f":"IF($B63=\"\",\"\",VLOOKUP($B63,Seznam!$A$4:$D$500,4))","v":2004},null,25,20,null,21,null,3,22]
[60,1,{"$f":"IF($B64=\"\",\"\",VLOOKUP($B64,Seznam!$A$4:$D$500,2))","v":"Jančák Richard"},{"$f":"IF($B64=\"\",\"\",VLOOKUP($B64,Seznam!$A$4:$D$500,3))","v":"Brušperk"},{"$f":"IF($B64=\"\",\"\",VLOOKUP($B64,Seznam!$A$4:$D$500,4))","v":2006},29.5,null,21,null,18,null,3,22.900000000000002]
[61,50,{"$f":"IF($B65=\"\",\"\",VLOOKUP($B65,Seznam!$A$4:$D$500,2))","v":"Kisiala David"},{"$f":"IF($B65=\"\",\"\",VLOOKUP($B65,Seznam!$A$4:$D$500,3))","v":"Český Těšín"},{"$f":"IF($B65=\"\",\"\",VLOOKUP($B65,Seznam!$A$4:$D$500,4))","v":2006},null,null,null,23,null,null,1,23]
[62,110,{"$f":"IF($B66=\"\",\"\",VLOOKUP($B66,Seznam!$A$4:$D$500,2))","v":"Fuchsík Šimon"},{"$f":"IF($B66=\"\",\"\",VLOOKUP($B66,Seznam!$A$4:$D$500,3))","v":"Frýdlant"},{"$f":"IF($B66=\"\",\"\",VLOOKUP($B66,Seznam!$A$4:$D$500,4))","v":2008},38,14,null,null,19,null,3,23.700000000000003]
[63,11,{"$f":"IF($B67=\"\",\"\",VLOOKUP($B67,Seznam!$A$4:$D$500,2))","v":"Ščerbová Barbora"},{"$f":"IF($B67=\"\",\"\",VLOOKUP($B67,Seznam!$A$4:$D$500,3))","v":"SK Frýdlant"},{"$f":"IF($B67=\"\",\"\",VLOOKUP($B67,Seznam!$A$4:$D$500,4))","v":2005},23.5,24,null,null,null,null,2,23.8]
[64,74,{"$f":"IF($B68=\"\",\"\",VLOOKUP($B68,Seznam!$A$4:$D$500,2))","v":"Somr Daniel"},{"$f":"IF($B68=\"\",\"\",VLOOKUP($B68,Seznam!$A$4:$D$500,3))","v":"Frýdlant"},{"$f":"IF($B68=\"\",\"\",VLOOKUP($B68,Seznam!$A$4:$D$500,4))","v":2007},23.900000000000002,null,null,null,null,null,1,23.9]
[65,104,{"$f":"IF($B69=\"\",\"\",VLOOKUP($B69,Seznam!$A$4:$D$500,2))","v":"Škandera Vojtěch"},{"$f":"IF($B69=\"\",\"\",VLOOKUP($B69,Seznam!$A$4:$D$500,3))","v":"Dolní Lomná"},{"$f":"IF($B69=\"\",\"\",VLOOKUP($B69,Seznam!$A$4:$D$500,4))","v":2004},24,null,null,null,null,null,{"$f":"IF(AND(F69=\"\",G69=\"\",H69=\"\",I69=\"\",J69=\"\",K69=\"\"),\"\",COUNTA(F69:K69))","v":1},{"$f":"IF(OR(F69>0,G69>0,H69>0,I69>0,J69>0,K69>0),ROUNDUP(SUM(F69:K69)/L69,1),\"\")","v":24}]
[66,124,{"$f":"IF($B70=\"\",\"\",VLOOKUP($B70,Seznam!$A$4:$D$500,2))","v":"Mlčoch Jan"},{"$f":"IF($B70=\"\",\"\",VLOOKUP($B70,Seznam!$A$4:$D$500,3))","v":"CDU Ostrava"},{"$f":"IF($B70=\"\",\"\",VLOOKUP($B70,Seznam!$A$4:$D$500,4))","v":2008},32,16,null,null,null,null,2,24]
[67,68,{"$f":"IF($B71=\"\",\"\",VLOOKUP($B71,Seznam!$A$4:$D$500,2))","v":"Janota Tomáš"},{"$f":"IF($B71=\"\",\"\",VLOOKUP($B71,Seznam!$A$4:$D$500,3))","v":"Český Těšín"},{"$f":"IF($B71=\"\",\"\",VLOOKUP($B71,Seznam!$A$4:$D$500,4))","v":2005},null,null,null,24,24,null,2,24]
[68,76,{"$f":"IF($B72=\"\",\"\",VLOOKUP($B72,Seznam!$A$4:$D$500,2))","v":"Vantuch Richard"},{"$f":"IF($B72=\"\",\"\",VLOOKUP($B72,Seznam!$A$4:$D$500,3))","v":"Brušperk"},{"$f":"IF($B72=\"\",\"\",VLOOKUP($B72,Seznam!$A$4:$D$500,4))","v":2009},null,null,24,null,null,null,1,24]
[69,12,{"$f":"IF($B73=\"\",\"\",VLOOKUP($B73,Seznam!$A$4:$D$500,2))","v":"Gavendová Andrea"},{"$f":"IF($B73=\"\",\"\",VLOOKUP($B73,Seznam!$A$4:$D$500,3))","v":"CDU Ostrava"},{"$f":"IF($B73=\"\",\"\",VLOOKUP($B73,Seznam!$A$4:$D$500,4))","v":2006},27,22,null,null,null,null,2,24.5]
[70,145,{"$f":"IF($B74=\"\",\"\",VLOOKUP($B74,Seznam!$A$4:$D$500,2))","v":"Dmytruch Michal"},{"$f":"IF($B74=\"\",\"\",VLOOKUP($B74,Seznam!$A$4:$D$500,3))","v":"SK Frýdlant"},{"$f":"IF($B74=\"\",\"\",VLOOKUP($B74,Seznam!$A$4:$D$500,4))","v":2001},null,30,19,null,null,null,2,24.5]
[71,28,{"$f":"IF($B75=\"\",\"\",VLOOKUP($B75,Seznam!$A$4:$D$500,2))","v":"Domenyová Klára"},{"$f":"IF($B75=\"\",\"\",VLOOKUP($B75,Seznam!$A$4:$D$500,3))","v":"Český Těšín"},{"$f":"IF($B75=\"\",\"\",VLOOKUP($B75,Seznam!$A$4:$D$500,4))","v":2003},null,null,null,28,22,null,2,25]
[72,137,{"$f":"IF($B76=\"\",\"\",VLOOKUP($B76,Seznam!$A$4:$D$500,2))","v":"Přeček Erik"},{"$f":"IF($B76=\"\",\"\",VLOOKUP($B76,Seznam!$A$4:$D$500,3))","v":"škola p-p Ostrava"},{"$f":"IF($B76=\"\",\"\",VLOOKUP($B76,Seznam!$A$4:$D$500,4))","v":2007},25,null,null,null,null,null,1,25]
[73,37,{"$f":"IF($B77=\"\",\"\",VLOOKUP($B77,Seznam!$A$4:$D$500,2))","v":"Huta Lukáš"},{"$f":"IF($B77=\"\",\"\",VLOOKUP($B77,Seznam!$A$4:$D$500,3))","v":"Třinec"},{"$f":"IF($B77=\"\",\"\",VLOOKUP($B77,Seznam!$A$4:$D$500,4))","v":2006},null,null,null,27,23,null,2,25]
[74,135,{"$f":"IF($B78=\"\",\"\",VLOOKUP($B78,Seznam!$A$4:$D$500,2))","v":"Blahuta Petr"},{"$f":"IF($B78=\"\",\"\",VLOOKUP($B78,Seznam!$A$4:$D$500,3))","v":"Frýdlant"},{"$f":"IF($B78=\"\",\"\",VLOOKUP($B78,Seznam!$A$4:$D$500,4))","v":2006},null,null,null,null,25,null,1,25]
[75,105,{"$f":"IF($B79=\"\",\"\",VLOOKUP($B79,Seznam!$A$4:$D$500,2))","v":"Martynek Filip"},{"$f":"IF($B79=\"\",\"\",VLOOKUP($B79,Seznam!$A$4:$D$500,3))","v":"Dolní Lomná"},{"$f":"IF($B79=\"\",\"\",VLOOKUP($B79,Seznam!$A$4:$D$500,4))","v":2003},25.2,null,null,null,null,null,1,25.2]
[76,103,{"$f":"IF($B80=\"\",\"\",VLOOKUP($B80,Seznam!$A$4:$D$500,2))","v":"Dostál Piotr"},{"$f":"IF($B80=\"\",\"\",VLOOKUP($B80,Seznam!$A$4:$D$500,3))","v":"Ropice"},{"$f":"IF($B80=\"\",\"\",VLOOKUP($B80,Seznam!$A$4:$D$500,4))","v":2005},25.3,null,null,null,null,null,1,25.3]
[77,78,{"$f":"IF($B81=\"\",\"\",VLOOKUP($B81,Seznam!$A$4:$D$500,2))","v":"Brozda David"},{"$f":"IF($B81=\"\",\"\",VLOOKUP($B81,Seznam!$A$4:$D$500,3))","v":"Ropice"},{"$f":"IF($B81=\"\",\"\",VLOOKUP($B81,Seznam!$A$4:$D$500,4))","v":2005},25.900000000000002,null,null,null,null,null,1,25.9]
[78,142,{"$f":"IF($B82=\"\",\"\",VLOOKUP($B82,Seznam!$A$4:$D$500,2))","v":"Kotas Jakub"},{"$f":"IF($B82=\"\",\"\",VLOOKUP($B82,Seznam!$A$4:$D$500,3))","v":"Třinec"},{"$f":"IF($B82=\"\",\"\",VLOOKUP($B82,Seznam!$A$4:$D$500,4))","v":2008},null,26,null,null,null,null,1,26]
[79,135,{"$f":"IF($B83=\"\",\"\",VLOOKUP($B83,Seznam!$A$4:$D$500,2))","v":"Blahuta Petr"},{"$f":"IF($B83=\"\",\"\",VLOOKUP($B83,Seznam!$A$4:$D$500,3))","v":"Frýdlant"},{"$f":"IF($B83=\"\",\"\",VLOOKUP($B83,Seznam!$A$4:$D$500,4))","v":2006},null,null,null,26,null,null,1,26]
[80,106,{"$f":"IF($B84=\"\",\"\",VLOOKUP($B84,Seznam!$A$4:$D$500,2))","v":"Gluza Jan"},{"$f":"IF($B84=\"\",\"\",VLOOKUP($B84,Seznam!$A$4:$D$500,3))","v":"Třinec"},{"$f":"IF($B84=\"\",\"\",VLOOKUP($B84,Seznam!$A$4:$D$500,4))","v":2005},null,null,null,null,26,null,1,26]
[81,124,{"$f":"IF($B85=\"\",\"\",VLOOKUP($B85,Seznam!$A$4:$D$500,2))","v":"Mlčoch Jan"},{"$f":"IF($B85=\"\",\"\",VLOOKUP($B85,Seznam!$A$4:$D$500,3))","v":"CDU Ostrava"},{"$f":"IF($B85=\"\",\"\",VLOOKUP($B85,Seznam!$A$4:$D$500,4))","v":2008},26.3,null,null,null,null,null,1,26.3]
[82,110,{"$f":"IF($B86=\"\",\"\",VLOOKUP($B86,Seznam!$A$4:$D$500,2))","v":"Fuchsík Šimon"},{"$f":"IF($B86=\"\",\"\",VLOOKUP($B86,Seznam!$A$4:$D$500,3))","v":"Frýdlant"},{"$f":"IF($B86=\"\",\"\",VLOOKUP($B86,Seznam!$A$4:$D$500,4))","v":2008},28,null,25,null,null,null,2,26.5]
[83,122,{"$f":"IF($B87=\"\",\"\",VLOOKUP($B87,Seznam!$A$4:$D$500,2))","v":"Brož Jan"},{"$f":"IF($B87=\"\",\"\",VLOOKUP($B87,Seznam!$A$4:$D$500,3))","v":"Brušperk"},{"$f":"IF($B87=\"\",\"\",VLOOKUP($B87,Seznam!$A$4:$D$500,4))","v":2006},30.400000000000002,null,23,null,null,null,2,26.7]
[null,151,{"$f":"IF($B88=\"\",\"\",VLOOKUP($B88,Seznam!$A$4:$D$500,2))","v":"Ježovič Jan"},{"$f":"IF($B88=\"\",\"\",VLOOKUP($B88,Seznam!$A$4:$D$500,3))","v":"Český Těšín"},{"$f":"IF($B88=\"\",\"\",VLOOKUP($B88,Seznam!$A$4:$D$500,4))","v":2005},null,null,null,null,27,null,1,27]
[85,101,{"$f":"IF($B89=\"\",\"\",VLOOKUP($B89,Seznam!$A$4:$D$500,2))","v":"Pánková Tereza"},{"$f":"IF($B89=\"\",\"\",VLOOKUP($B89,Seznam!$A$4:$D$500,3))","v":"Kozlovice"},{"$f":"IF($B89=\"\",\"\",VLOOKUP($B89,Seznam!$A$4:$D$500,4))","v":2007},31.2,23,27,null,null,null,3,27.1]
[86,61,{"$f":"IF($B90=\"\",\"\",VLOOKUP($B90,Seznam!$A$4:$D$500,2))","v":"Šefl Josef"},{"$f":"IF($B90=\"\",\"\",VLOOKUP($B90,Seznam!$A$4:$D$500,3))","v":"Brušperk"},{"$f":"IF($B90=\"\",\"\",VLOOKUP($B90,Seznam!$A$4:$D$500,4))","v":2006},27.700000000000003,null,null,null,null,null,1,27.7]
[87,14,{"$f":"IF($B91=\"\",\"\",VLOOKUP($B91,Seznam!$A$4:$D$500,2))","v":"Káňa Tomáš"},{"$f":"IF($B91=\"\",\"\",VLOOKUP($B91,Seznam!$A$4:$D$500,3))","v":"SK Frýdlant"},{"$f":"IF($B91=\"\",\"\",VLOOKUP($B91,Seznam!$A$4:$D$500,4))","v":2007},28,null,null,null,null,null,1,28]
[88,143,{"$f":"IF($B92=\"\",\"\",VLOOKUP($B92,Seznam!$A$4:$D$500,2))","v":"Macíček Jan"},{"$f":"IF($B92=\"\",\"\",VLOOKUP($B92,Seznam!$A$4:$D$500,3))","v":"Mořkov"},{"$f":"IF($B92=\"\",\"\",VLOOKUP($B92,Seznam!$A$4:$D$500,4))","v":2004},null,28,null,null,null,null,1,28]
[89,134,{"$f":"IF($B93=\"\",\"\",VLOOKUP($B93,Seznam!$A$4:$D$500,2))","v":"Viňanský Pavel"},{"$f":"IF($B93=\"\",\"\",VLOOKUP($B93,Seznam!$A$4:$D$500,3))","v":"Brušperk"},{"$f":"IF($B93=\"\",\"\",VLOOKUP($B93,Seznam!$A$4:$D$500,4))","v":2008},51,20,26,25,20,null,5,28.4]
[90,125,{"$f":"IF($B94=\"\",\"\",VLOOKUP($B94,Seznam!$A$4:$D$500,2))","v":"Fabián Tobiáš"},{"$f":"IF($B94=\"\",\"\",VLOOKUP($B94,Seznam!$A$4:$D$500,3))","v":"TTC F-M"},{"$f":"IF($B94=\"\",\"\",VLOOKUP($B94,Seznam!$A$4:$D$500,4))","v":2011},36,21,null,null,null,null,2,28.5]
[91,127,{"$f":"IF($B95=\"\",\"\",VLOOKUP($B95,Seznam!$A$4:$D$500,2))","v":"Voloch Jiří"},{"$f":"IF($B95=\"\",\"\",VLOOKUP($B95,Seznam!$A$4:$D$500,3))","v":"CDU Ostrava"},{"$f":"IF($B95=\"\",\"\",VLOOKUP($B95,Seznam!$A$4:$D$500,4))","v":2004},29,null,null,null,null,null,1,29]
[92,86,{"$f":"IF($B96=\"\",\"\",VLOOKUP($B96,Seznam!$A$4:$D$500,2))","v":"Fajkus Milan"},{"$f":"IF($B96=\"\",\"\",VLOOKUP($B96,Seznam!$A$4:$D$500,3))","v":"Frýdlant"},{"$f":"IF($B96=\"\",\"\",VLOOKUP($B96,Seznam!$A$4:$D$500,4))","v":2005},29,null,null,null,null,null,1,29]
[93,144,{"$f":"IF($B97=\"\",\"\",VLOOKUP($B97,Seznam!$A$4:$D$500,2))","v":"Kaiser František"},{"$f":"IF($B97=\"\",\"\",VLOOKUP($B97,Seznam!$A$4:$D$500,3))","v":"SK Frýdlant"},{"$f":"IF($B97=\"\",\"\",VLOOKUP($B97,Seznam!$A$4:$D$500,4))","v":2005},null,29,null,null,null,null,1,29]
[94,22,{"$f":"IF($B98=\"\",\"\",VLOOKUP($B98,Seznam!$A$4:$D$500,2))","v":"Byrtus David"},{"$f":"IF($B98=\"\",\"\",VLOOKUP($B98,Seznam!$A$4:$D$500,3))","v":"Český Těšín"},{"$f":"IF($B98=\"\",\"\",VLOOKUP($B98,Seznam!$A$4:$D$500,4))","v":2004},null,null,null,29,29,null,2,29]
[95,123,{"$f":"IF($B99=\"\",\"\",VLOOKUP($B99,Seznam!$A$4:$D$500,2))","v":"Kočvara Lukáš"},{"$f":"IF($B99=\"\",\"\",VLOOKUP($B99,Seznam!$A$4:$D$500,3))","v":"CDU Ostrava"},{"$f":"IF($B99=\"\",\"\",VLOOKUP($B99,Seznam!$A$4:$D$500,4))","v":2006},30,null,null,null,null,null,1,30]
[96,91,{"$f":"IF($B100=\"\",\"\",VLOOKUP($B100,Seznam!$A$4:$D$500,2))","v":"Franěk Ondřej"},{"$f":"IF($B100=\"\",\"\",VLOOKUP($B100,Seznam!$A$4:$D$500,3))","v":"Frýdlant"},{"$f":"IF($B100=\"\",\"\",VLOOKUP($B100,Seznam!$A$4:$D$500,4))","v":2005},30,null,null,null,null,null,1,30]
[97,35,{"$f":"IF($B101=\"\",\"\",VLOOKUP($B101,Seznam!$A$4:$D$500,2))","v":"Moravec Václav"},{"$f":"IF($B101=\"\",\"\",VLOOKUP($B101,Seznam!$A$4:$D$500,3))","v":"Paskov"},{"$f":"IF($B101=\"\",\"\",VLOOKUP($B101,Seznam!$A$4:$D$500,4))","v":2008},null,null,30,null,null,null,{"$f":"IF(AND(F101=\"\",G101=\"\",H101=\"\",I101=\"\",J101=\"\",K101=\"\"),\"\",COUNTA(F101:K101))","v":1},{"$f":"IF(OR(F101>0,G101>0,H101>0,I101>0,J101>0,K101>0),ROUNDUP(SUM(F101:K101)/L101,1),\"\")","v":30}]
[98,24,{"$f":"IF($B102=\"\",\"\",VLOOKUP($B102,Seznam!$A$4:$D$500,2))","v":"Břenek Jiří"},{"$f":"IF($B102=\"\",\"\",VLOOKUP($B102,Seznam!$A$4:$D$500,3))","v":"Karviná"},{"$f":"IF($B102=\"\",\"\",VLOOKUP($B102,Seznam!$A$4:$D$500,4))","v":2009},null,null,null,30,null,null,1,30]
[99,25,{"$f":"IF($B103=\"\",\"\",VLOOKUP($B103,Seznam!$A$4:$D$500,2))","v":"Smetana Jan"},{"$f":"IF($B103=\"\",\"\",VLOOKUP($B103,Seznam!$A$4:$D$500,3))","v":"Třinec"},{"$f":"IF($B103=\"\",\"\",VLOOKUP($B103,Seznam!$A$4:$D$500,4))","v":2008},null,null,null,32,28,null,2,30]
[100,73,{"$f":"IF($B104=\"\",\"\",VLOOKUP($B104,Seznam!$A$4:$D$500,2))","v":"Pščolka Michael"},{"$f":"IF($B104=\"\",\"\",VLOOKUP($B104,Seznam!$A$4:$D$500,3))","v":"Vendryně"},{"$f":"IF($B104=\"\",\"\",VLOOKUP($B104,Seznam!$A$4:$D$500,4))","v":2005},30.5,null,null,null,null,null,1,30.5]
[101,146,{"$f":"IF($B105=\"\",\"\",VLOOKUP($B105,Seznam!$A$4:$D$500,2))","v":"Polášek Daniel"},{"$f":"IF($B105=\"\",\"\",VLOOKUP($B105,Seznam!$A$4:$D$500,3))","v":"SK Frýdlant"},{"$f":"IF($B105=\"\",\"\",VLOOKUP($B105,Seznam!$A$4:$D$500,4))","v":2007},null,31,null,null,null,null,1,31]
[102,41,{"$f":"IF($B106=\"\",\"\",VLOOKUP($B106,Seznam!$A$4:$D$500,2))","v":"Břenková Kristýna"},{"$f":"IF($B106=\"\",\"\",VLOOKUP($B106,Seznam!$A$4:$D$500,3))","v":"Karviná"},{"$f":"IF($B106=\"\",\"\",VLOOKUP($B106,Seznam!$A$4:$D$500,4))","v":2009},null,null,null,31,null,null,1,31]
[103,152,{"$f":"IF($B107=\"\",\"\",VLOOKUP($B107,Seznam!$A$4:$D$500,2))","v":"Mniszak Lukáš"},{"$f":"IF($B107=\"\",\"\",VLOOKUP($B107,Seznam!$A$4:$D$500,3))","v":"Frýdlant"},{"$f":"IF($B107=\"\",\"\",VLOOKUP($B107,Seznam!$A$4:$D$500,4))","v":2004},null,null,null,null,31,null,1,31]
[104,147,{"$f":"IF($B108=\"\",\"\",VLOOKUP($B108,Seznam!$A$4:$D$500,2))","v":"Michna Oskar"},{"$f":"IF($B108=\"\",\"\",VLOOKUP($B108,Seznam!$A$4:$D$500,3))","v":"Paskov"},{"$f":"IF($B108=\"\",\"\",VLOOKUP($B108,Seznam!$A$4:$D$500,4))","v":2007},null,32,31,null,32,null,3,31.700000000000003]
[105,21,{"$f":"IF($B109=\"\",\"\",VLOOKUP($B109,Seznam!$A$4:$D$500,2))","v":"Dudková Jana"},{"$f":"IF($B109=\"\",\"\",VLOOKUP($B109,Seznam!$A$4:$D$500,3))","v":"TTC Frýdlant"},{"$f":"IF($B109=\"\",\"\",VLOOKUP($B109,Seznam!$A$4:$D$500,4))","v":2007},33,null,28,34,null,null,3,31.700000000000003]
[106,29,{"$f":"IF($B110=\"\",\"\",VLOOKUP($B110,Seznam!$A$4:$D$500,2))","v":"Karásek Kryštof"},{"$f":"IF($B110=\"\",\"\",VLOOKUP($B110,Seznam!$A$4:$D$500,3))","v":"TTC Frýdlant"},{"$f":"IF($B110=\"\",\"\",VLOOKUP($B110,Seznam!$A$4:$D$500,4))","v":2005},null,null,29,35,null,null,2,32]
[107,108,{"$f":"IF($B111=\"\",\"\",VLOOKUP($B111,Seznam!$A$4:$D$500,2))","v":"Danemark Roman"},{"$f":"IF($B111=\"\",\"\",VLOOKUP($B111,Seznam!$A$4:$D$500,3))","v":"Ropice"},{"$f":"IF($B111=\"\",\"\",VLOOKUP($B111,Seznam!$A$4:$D$500,4))","v":2004},32.4,null,null,null,null,null,1,32.4]
[108,31,{"$f":"IF($B112=\"\",\"\",VLOOKUP($B112,Seznam!$A$4:$D$500,2))","v":"Strašák Filip"},{"$f":"IF($B112=\"\",\"\",VLOOKUP($B112,Seznam!$A$4:$D$500,3))","v":"Třinec"},{"$f":"IF($B112=\"\",\"\",VLOOKUP($B112,Seznam!$A$4:$D$500,4))","v":2007},null,null,null,36,29,null,2,32.5]
[109,148,{"$f":"IF($B113=\"\",\"\",VLOOKUP($B113,Seznam!$A$4:$D$500,2))","v":"Bortel Kryštof"},{"$f":"IF($B113=\"\",\"\",VLOOKUP($B113,Seznam!$A$4:$D$500,3))","v":"CDU Ostrava"},{"$f":"IF($B113=\"\",\"\",VLOOKUP($B113,Seznam!$A$4:$D$500,4))","v":2009},null,33,null,null,null,null,1,33]
[110,56,{"$f":"IF($B114=\"\",\"\",VLOOKUP($B114,Seznam!$A$4:$D$500,2))","v":"Stodůlková Tereza"},{"$f":"IF($B114=\"\",\"\",VLOOKUP($B114,Seznam!$A$4:$D$500,3))","v":"SK Frýdlant"},{"$f":"IF($B114=\"\",\"\",VLOOKUP($B114,Seznam!$A$4:$D$500,4))","v":2008},null,null,33,null,null,null,1,33]
[111,153,{"$f":"IF($B115=\"\",\"\",VLOOKUP($B115,Seznam!$A$4:$D$500,2))","v":"Kocián Vojtěch"},{"$f":"IF($B115=\"\",\"\",VLOOKUP($B115,Seznam!$A$4:$D$500,3))","v":"Brušperk"},{"$f":"IF($B115=\"\",\"\",VLOOKUP($B115,Seznam!$A$4:$D$500,4))","v":2006},null,null,null,null,33,null,1,33]
[112,92,{"$f":"IF($B116=\"\",\"\",VLOOKUP($B116,Seznam!$A$4:$D$500,2))","v":"Papíková Elizabeth"},{"$f":"IF($B116=\"\",\"\",VLOOKUP($B116,Seznam!$A$4:$D$500,3))","v":"Frýdlant"},{"$f":"IF($B116=\"\",\"\",VLOOKUP($B116,Seznam!$A$4:$D$500,4))","v":2006},33.5,null,null,null,null,null,1,33.5]
[113,149,{"$f":"IF($B117=\"\",\"\",VLOOKUP($B117,Seznam!$A$4:$D$500,2))","v":"Menšík Martin"},{"$f":"IF($B117=\"\",\"\",VLOOKUP($B117,Seznam!$A$4:$D$500,3))","v":"SK Frýdlant"},{"$f":"IF($B117=\"\",\"\",VLOOKUP($B117,Seznam!$A$4:$D$500,4))","v":2010},null,34,null,null,null,null,1,34]
[114,154,{"$f":"IF($B118=\"\",\"\",VLOOKUP($B118,Seznam!$A$4:$D$500,2))","v":"Brudný Sebastián"},{"$f":"IF($B118=\"\",\"\",VLOOKUP($B118,Seznam!$A$4:$D$500,3))","v":"Český Těšín"},{"$f":"IF($B118=\"\",\"\",VLOOKUP($B118,Seznam!$A$4:$D$500,4))","v":2008},null,null,null,null,34,null,1,34]
[115,150,{"$f":"IF($B119=\"\",\"\",VLOOKUP($B119,Seznam!$A$4:$D$500,2))","v":"Filip Matouš"},{"$f":"IF($B119=\"\",\"\",VLOOKUP($B119,Seznam!$A$4:$D$500,3))","v":"SK Frýdlant"},{"$f":"IF($B119=\"\",\"\",VLOOKUP($B119,Seznam!$A$4:$D$500,4))","v":2010},null,35,null,null,null,null,1,35]
[116,155,{"$f":"IF($B120=\"\",\"\",VLOOKUP($B120,Seznam!$A$4:$D$500,2))","v":"Stavarský Jakub"},{"$f":"IF($B120=\"\",\"\",VLOOKUP($B120,Seznam!$A$4:$D$500,3))","v":"Český Těšín"},{"$f":"IF($B120=\"\",\"\",VLOOKUP($B120,Seznam!$A$4:$D$500,4))","v":2006},null,null,null,null,35,null,1,35]
[117,156,{"$f":"IF($B121=\"\",\"\",VLOOKUP($B121,Seznam!$A$4:$D$500,2))","v":"Hrabovský Adam"},{"$f":"IF($B121=\"\",\"\",VLOOKUP($B121,Seznam!$A$4:$D$500,3))","v":"Brušperk"},{"$f":"IF($B121=\"\",\"\",VLOOKUP($B121,Seznam!$A$4:$D$500,4))","v":2006},null,null,null,null,36,null,1,36]
[118,83,{"$f":"IF($B122=\"\",\"\",VLOOKUP($B122,Seznam!$A$4:$D$500,2))","v":"Tikal Tobiáš"},{"$f":"IF($B122=\"\",\"\",VLOOKUP($B122,Seznam!$A$4:$D$500,3))","v":"TTC F-M"},{"$f":"IF($B122=\"\",\"\",VLOOKUP($B122,Seznam!$A$4:$D$500,4))","v":2008},36.5,null,null,null,null,null,1,36.5]
[119,136,{"$f":"IF($B123=\"\",\"\",VLOOKUP($B123,Seznam!$A$4:$D$500,2))","v":"Špaček Michal"},{"$f":"IF($B123=\"\",\"\",VLOOKUP($B123,Seznam!$A$4:$D$500,3))","v":"Brušperk"},{"$f":"IF($B123=\"\",\"\",VLOOKUP($B123,Seznam!$A$4:$D$500,4))","v":2007},53,27,31,null,null,null,3,37]
[120,46,{"$f":"IF($B124=\"\",\"\",VLOOKUP($B124,Seznam!$A$4:$D$500,2))","v":"Kotas Jakub"},{"$f":"IF($B124=\"\",\"\",VLOOKUP($B124,Seznam!$A$4:$D$500,3))","v":"Třinec"},{"$f":"IF($B124=\"\",\"\",VLOOKUP($B124,Seznam!$A$4:$D$500,4))","v":2008},null,null,null,37,null,null,1,37]
[121,157,{"$f":"IF($B125=\"\",\"\",VLOOKUP($B125,Seznam!$A$4:$D$500,2))","v":"Zvrtek Lukáš"},{"$f":"IF($B125=\"\",\"\",VLOOKUP($B125,Seznam!$A$4:$D$500,3))","v":"Třinec"},{"$f":"IF($B125=\"\",\"\",VLOOKUP($B125,Seznam!$A$4:$D$500,4))","v":2007},null,null,null,null,37,null,1,37]
[122,53,{"$f":"IF($B126=\"\",\"\",VLOOKUP($B126,Seznam!$A$4:$D$500,2))","v":"Pustka Adam "},{"$f":"IF($B126=\"\",\"\",VLOOKUP($B126,Seznam!$A$4:$D$500,3))","v":"Kozlovice"},{"$f":"IF($B126=\"\",\"\",VLOOKUP($B126,Seznam!$A$4:$D$500,4))","v":2008},null,null,null,33,42,null,2,37.5]
[123,51,{"$f":"IF($B127=\"\",\"\",VLOOKUP($B127,Seznam!$A$4:$D$500,2))","v":"Svoboda Vojtěch"},{"$f":"IF($B127=\"\",\"\",VLOOKUP($B127,Seznam!$A$4:$D$500,3))","v":"TTC F-M"},{"$f":"IF($B127=\"\",\"\",VLOOKUP($B127,Seznam!$A$4:$D$500,4))","v":2006},37.5,null,null,null,null,null,1,37.5]
[124,8,{"$f":"IF($B128=\"\",\"\",VLOOKUP($B128,Seznam!$A$4:$D$500,2))","v":"Kociánová Natálie"},{"$f":"IF($B128=\"\",\"\",VLOOKUP($B128,Seznam!$A$4:$D$500,3))","v":"TTC Frýdlant"},{"$f":"IF($B128=\"\",\"\",VLOOKUP($B128,Seznam!$A$4:$D$500,4))","v":2009},35.300000000000004,null,null,null,40,null,2,37.700000000000003]
[125,158,{"$f":"IF($B129=\"\",\"\",VLOOKUP($B129,Seznam!$A$4:$D$500,2))","v":"Tomalík Ondřej"},{"$f":"IF($B129=\"\",\"\",VLOOKUP($B129,Seznam!$A$4:$D$500,3))","v":"TTC Frýdlant"},{"$f":"IF($B129=\"\",\"\",VLOOKUP($B129,Seznam!$A$4:$D$500,4))","v":2009},null,null,null,null,38,null,1,38]
[126,159,{"$f":"IF($B130=\"\",\"\",VLOOKUP($B130,Seznam!$A$4:$D$500,2))","v":"Kajfosz Jakub"},{"$f":"IF($B130=\"\",\"\",VLOOKUP($B130,Seznam!$A$4:$D$500,3))","v":"Třinec"},{"$f":"IF($B130=\"\",\"\",VLOOKUP($B130,Seznam!$A$4:$D$500,4))","v":2006},null,null,null,null,39,null,1,39]
[127,50,{"$f":"IF($B131=\"\",\"\",VLOOKUP($B131,Seznam!$A$4:$D$500,2))","v":"Kisiala David"},{"$f":"IF($B131=\"\",\"\",VLOOKUP($B131,Seznam!$A$4:$D$500,3))","v":"Český Těšín"},{"$f":"IF($B131=\"\",\"\",VLOOKUP($B131,Seznam!$A$4:$D$500,4))","v":2006},null,null,null,null,41,null,1,41]
[128,161,{"$f":"IF($B132=\"\",\"\",VLOOKUP($B132,Seznam!$A$4:$D$500,2))","v":"Lepík František"},{"$f":"IF($B132=\"\",\"\",VLOOKUP($B132,Seznam!$A$4:$D$500,3))","v":"Kozlovice"},{"$f":"IF($B132=\"\",\"\",VLOOKUP($B132,Seznam!$A$4:$D$500,4))","v":2008},null,null,null,null,43,null,1,43]
[129,162,{"$f":"IF($B133=\"\",\"\",VLOOKUP($B133,Seznam!$A$4:$D$500,2))","v":"Žáček Jakub"},{"$f":"IF($B133=\"\",\"\",VLOOKUP($B133,Seznam!$A$4:$D$500,3))","v":"Kozlovice"},{"$f":"IF($B133=\"\",\"\",VLOOKUP($B133,Seznam!$A$4:$D$500,4))","v":2008},null,null,null,null,44,null,{"$f":"IF(AND(F133=\"\",G133=\"\",H133=\"\",I133=\"\",J133=\"\",K133=\"\"),\"\",COUNTA(F133:K133))","v":1},{"$f":"IF(OR(F133>0,G133>0,H133>0,I133>0,J133>0,K133>0),ROUNDUP(SUM(F133:K133)/L133,1),\"\")","v":44}]
[130,163,{"$f":"IF($B134=\"\",\"\",VLOOKUP($B134,Seznam!$A$4:$D$500,2))","v":"Vitt Tomáš"},{"$f":"IF($B134=\"\",\"\",VLOOKUP($B134,Seznam!$A$4:$D$500,3))","v":"Kozlovice"},{"$f":"IF($B134=\"\",\"\",VLOOKUP($B134,Seznam!$A$4:$D$500,4))","v":2008},null,null,null,null,45,null,1,45]
[131,164,{"$f":"IF($B135=\"\",\"\",VLOOKUP($B135,Seznam!$A$4:$D$500,2))","v":"Rakowski Jan"},{"$f":"IF($B135=\"\",\"\",VLOOKUP($B135,Seznam!$A$4:$D$500,3))","v":"Třinec"},{"$f":"IF($B135=\"\",\"\",VLOOKUP($B135,Seznam!$A$4:$D$500,4))","v":2006},null,null,null,null,46,null,1,46]
[132,165,{"$f":"IF($B136=\"\",\"\",VLOOKUP($B136,Seznam!$A$4:$D$500,2))","v":"Turek Dalibor"},{"$f":"IF($B136=\"\",\"\",VLOOKUP($B136,Seznam!$A$4:$D$500,3))","v":"?"},{"$f":"IF($B136=\"\",\"\",VLOOKUP($B136,Seznam!$A$4:$D$500,4))","v":"?"},null,null,null,null,47,null,1,47]
[133,160,{"$f":"IF($B137=\"\",\"\",VLOOKUP($B137,Seznam!$A$4:$D$500,2))","v":"Pánek Michal"},{"$f":"IF($B137=\"\",\"\",VLOOKUP($B137,Seznam!$A$4:$D$500,3))","v":"Český Těšín"},{"$f":"IF($B137=\"\",\"\",VLOOKUP($B137,Seznam!$A$4:$D$500,4))","v":2007},null,null,null,null,48,null,1,48]
[134]
[135]
[136]
[137]
[138]
[139]
[140]
[141]
[142]
[143]
[144]
[145]
[146]
[147]
[148]
[149]
[150]

{"sheet":"průběžné bodové pořadí","index":2,"n_rows":120,"n_cols":13,"rows_kept":120,"cut":false,"hidden":false,"merged":[[0,0,0,12]]}
["Průběžné bodové pořadí v jednotlivých kategoriích"]
[null,null,"První 3 v každé kat. obdrží věcné ceny"]
[null,null,"1.místo - 5 Bodů, 2.místo - 4 body, 3.místo - 3 body, 4.místo - 2 body, 5.místo - 1 bod."]
[null,null,"Počítají se 4 nejlepší výsledky"]
[null,null,null,null,null,1,2,3,4,5,6]
[null,null,"Dorost",null,null,"Fryd.","Brušp.","ČT","ČT","Fryd.",null,"počet turnajů","celkem      bodů"]
["poř.","č.h.","jméno","oddíl/klub","nar."]
["1.",59,{"$f":"IF($B8=\"\",\"\",VLOOKUP($B8,Seznam!$A$4:$K$500,2))","v":"Szotkowski Jan"},{"$f":"IF($B8=\"\",\"\",VLOOKUP($B8,Seznam!$A$4:$K$500,3))","v":"Třinec"},{"$f":"IF($B8=\"\",\"\",VLOOKUP($B8,Seznam!$A$4:$K$500,4))","v":2006},null,null,5,5,null,null,{"$f":"IF(AND(J8=\"\",F8=\"\",G8=\"\",H8=\"\",I8=\"\"),\"\",COUNTA(F8:J8))","v":2},{"$f":"IF(B8=\"\",0,SUM(IF(ISERROR(LARGE(F8:J8,1)),0,LARGE(F8:J8,1)),IF(ISERROR(LARGE(F8:J8,2)),0,LARGE(F8:J8,2)),IF(ISERROR(LARGE(F8:J8,3)),0,LARGE(F8:J8,3)),IF(ISERROR(LARGE(F8:J8,4)),0,LARGE(F8:J8,4))))","v":10}]
["2.",13,{"$f":"IF($B9=\"\",\"\",VLOOKUP($B9,Seznam!$A$4:$K$500,2))","v":"Neuwirth Jaroslav"},{"$f":"IF($B9=\"\",\"\",VLOOKUP($B9,Seznam!$A$4:$K$500,3))","v":"Brušperk"},{"$f":"IF($B9=\"\",\"\",VLOOKUP($B9,Seznam!$A$4:$K$500,4))","v":2002},5,3,null,null,null,null,{"$f":"IF(AND(J9=\"\",F9=\"\",G9=\"\",H9=\"\",I9=\"\"),\"\",COUNTA(F9:J9))","v":2},{"$f":"IF(B9=\"\",0,SUM(IF(ISERROR(LARGE(F9:J9,1)),0,LARGE(F9:J9,1)),IF(ISERROR(LARGE(F9:J9,2)),0,LARGE(F9:J9,2)),IF(ISERROR(LARGE(F9:J9,3)),0,LARGE(F9:J9,3)),IF(ISERROR(LARGE(F9:J9,4)),0,LARGE(F9:J9,4))))","v":8}]
["3.",38,{"$f":"IF($B10=\"\",\"\",VLOOKUP($B10,Seznam!$A$4:$K$500,2))","v":"Zvrtek Jan"},{"$f":"IF($B10=\"\",\"\",VLOOKUP($B10,Seznam!$A$4:$K$500,3))","v":"Návsí"},{"$f":"IF($B10=\"\",\"\",VLOOKUP($B10,Seznam!$A$4:$K$500,4))","v":2004},null,null,4,4,null,null,{"$f":"IF(AND(J10=\"\",F10=\"\",G10=\"\",H10=\"\",I10=\"\"),\"\",COUNTA(F10:J10))","v":2},{"$f":"IF(B10=\"\",0,SUM(IF(ISERROR(LARGE(F10:J10,1)),0,LARGE(F10:J10,1)),IF(ISERROR(LARGE(F10:J10,2)),0,LARGE(F10:J10,2)),IF(ISERROR(LARGE(F10:J10,3)),0,LARGE(F10:J10,3)),IF(ISERROR(LARGE(F10:J10,4)),0,LARGE(F10:J10,4))))","v":8}]
["4.",27,{"$f":"IF($B11=\"\",\"\",VLOOKUP($B11,Seznam!$A$4:$D$500,2))","v":"Hýl Jakub"},{"$f":"IF($B11=\"\",\"\",VLOOKUP($B11,Seznam!$A$4:$K$500,3))","v":"Brušperk"},{"$f":"IF($B11=\"\",\"\",VLOOKUP($B11,Seznam!$A$4:$K$500,4))","v":2006},4,2,null,null,null,null,{"$f":"IF(AND(J11=\"\",F11=\"\",G11=\"\",H11=\"\",I11=\"\",K11),\"\",COUNTA(F11:K11))","v":2},{"$f":"IF(B11=\"\",0,SUM(IF(ISERROR(LARGE(F11:K11,1)),0,LARGE(F11:K11,1)),IF(ISERROR(LARGE(F11:K11,2)),0,LARGE(F11:K11,2)),IF(ISERROR(LARGE(F11:K11,3)),0,LARGE(F11:K11,3)),IF(ISERROR(LARGE(F11:K11,4)),0,LARGE(F11:K11,4))))","v":6}]
["5.",95,{"$f":"IF($B12=\"\",\"\",VLOOKUP($B12,Seznam!$A$4:$K$500,2))","v":"Ondračka Adam"},{"$f":"IF($B12=\"\",\"\",VLOOKUP($B12,Seznam!$A$4:$K$500,3))","v":"Frýdlant"},{"$f":"IF($B12=\"\",\"\",VLOOKUP($B12,Seznam!$A$4:$K$500,4))","v":2007},3,null,3,null,null,null,{"$f":"IF(AND(J12=\"\",F12=\"\",G12=\"\",H12=\"\",I12=\"\"),\"\",COUNTA(F12:J12))","v":2},{"$f":"IF(B12=\"\",0,SUM(IF(ISERROR(LARGE(F12:J12,1)),0,LARGE(F12:J12,1)),IF(ISERROR(LARGE(F12:J12,2)),0,LARGE(F12:J12,2)),IF(ISERROR(LARGE(F12:J12,3)),0,LARGE(F12:J12,3)),IF(ISERROR(LARGE(F12:J12,4)),0,LARGE(F12:J12,4))))","v":6}]
["6.",20,{"$f":"IF($B13=\"\",\"\",VLOOKUP($B13,Seznam!$A$4:$K$500,2))","v":"Mrowetz Bruno"},{"$f":"IF($B13=\"\",\"\",VLOOKUP($B13,Seznam!$A$4:$K$500,3))","v":"Brušperk"},{"$f":"IF($B13=\"\",\"\",VLOOKUP($B13,Seznam!$A$4:$K$500,4))","v":2004},null,5,null,null,null,null,1,5]
["7.",5,{"$f":"IF($B14=\"\",\"\",VLOOKUP($B14,Seznam!$A$4:$K$500,2))","v":"Janečka Martin"},{"$f":"IF($B14=\"\",\"\",VLOOKUP($B14,Seznam!$A$4:$K$500,3))","v":"Brušperk"},{"$f":"IF($B14=\"\",\"\",VLOOKUP($B14,Seznam!$A$4:$K$500,4))","v":2002},null,4,null,null,null,null,1,4]
["8.",97,{"$f":"IF($B15=\"\",\"\",VLOOKUP($B15,Seznam!$A$4:$K$500,2))","v":"Bakota Adam"},{"$f":"IF($B15=\"\",\"\",VLOOKUP($B15,Seznam!$A$4:$K$500,3))","v":"Frýdlant"},{"$f":"IF($B15=\"\",\"\",VLOOKUP($B15,Seznam!$A$4:$K$500,4))","v":2006},null,1,2,null,null,null,2,3]
["9.",107,{"$f":"IF($B16=\"\",\"\",VLOOKUP($B16,Seznam!$A$4:$K$500,2))","v":"Jokiel Patrik"},{"$f":"IF($B16=\"\",\"\",VLOOKUP($B16,Seznam!$A$4:$K$500,3))","v":"Český Těšín"},{"$f":"IF($B16=\"\",\"\",VLOOKUP($B16,Seznam!$A$4:$K$500,4))","v":2001},null,null,null,3,null,null,1,3]
["10.",9,{"$f":"IF($B17=\"\",\"\",VLOOKUP($B17,Seznam!$A$4:$K$500,2))","v":"Šlachta Prokop Antonín"},{"$f":"IF($B17=\"\",\"\",VLOOKUP($B17,Seznam!$A$4:$K$500,3))","v":"Frýdek - Místek"},{"$f":"IF($B17=\"\",\"\",VLOOKUP($B17,Seznam!$A$4:$K$500,4))","v":2006},2,null,null,null,null,null,1,2]
["11.",138,{"$f":"IF($B18=\"\",\"\",VLOOKUP($B18,Seznam!$A$4:$K$500,2))","v":"Halfar Jan"},{"$f":"IF($B18=\"\",\"\",VLOOKUP($B18,Seznam!$A$4:$K$500,3))","v":"Český Těšín"},{"$f":"IF($B18=\"\",\"\",VLOOKUP($B18,Seznam!$A$4:$K$500,4))","v":2005},null,null,null,2,null,null,1,2]
["12.",82,{"$f":"IF($B19=\"\",\"\",VLOOKUP($B19,Seznam!$A$4:$K$500,2))","v":"Pánek Jakub"},{"$f":"IF($B19=\"\",\"\",VLOOKUP($B19,Seznam!$A$4:$K$500,3))","v":"Kozlovice"},{"$f":"IF($B19=\"\",\"\",VLOOKUP($B19,Seznam!$A$4:$K$500,4))","v":2005},1,null,null,null,null,null,1,1]
["13.",121,{"$f":"IF($B20=\"\",\"\",VLOOKUP($B20,Seznam!$A$4:$K$500,2))","v":"Kotajný Jakub"},{"$f":"IF($B20=\"\",\"\",VLOOKUP($B20,Seznam!$A$4:$K$500,3))","v":"Vendryně"},{"$f":"IF($B20=\"\",\"\",VLOOKUP($B20,Seznam!$A$4:$K$500,4))","v":2003},null,null,1,null,null,null,1,1]
["14.",98,{"$f":"IF($B21=\"\",\"\",VLOOKUP($B21,Seznam!$A$4:$K$500,2))","v":"Hamar Tomáš"},{"$f":"IF($B21=\"\",\"\",VLOOKUP($B21,Seznam!$A$4:$K$500,3))","v":"Brušperk"},{"$f":"IF($B21=\"\",\"\",VLOOKUP($B21,Seznam!$A$4:$K$500,4))","v":2004},null,null,null,1,null,null,1,1]
["15.",null,{"$f":"IF($B22=\"\",\"\",VLOOKUP($B22,Seznam!$A$4:$K$500,2))","v":""},{"$f":"IF($B22=\"\",\"\",VLOOKUP($B22,Seznam!$A$4:$K$500,3))","v":""},{"$f":"IF($B22=\"\",\"\",VLOOKUP($B22,Seznam!$A$4:$K$500,4))","v":""},null,null,null,null,null,null,"",0]
["16.",null,{"$f":"IF($B23=\"\",\"\",VLOOKUP($B23,Seznam!$A$4:$K$500,2))","v":""},{"$f":"IF($B23=\"\",\"\",VLOOKUP($B23,Seznam!$A$4:$K$500,3))","v":""},{"$f":"IF($B23=\"\",\"\",VLOOKUP($B23,Seznam!$A$4:$K$500,4))","v":""},null,null,null,null,null,null,"",0]
["17.",null,{"$f":"IF($B24=\"\",\"\",VLOOKUP($B24,Seznam!$A$4:$K$500,2))","v":""},{"$f":"IF($B24=\"\",\"\",VLOOKUP($B24,Seznam!$A$4:$K$500,3))","v":""},{"$f":"IF($B24=\"\",\"\",VLOOKUP($B24,Seznam!$A$4:$K$500,4))","v":""},null,null,null,null,null,null,"",0]
["18.",null,{"$f":"IF($B25=\"\",\"\",VLOOKUP($B25,Seznam!$A$4:$K$500,2))","v":""},{"$f":"IF($B25=\"\",\"\",VLOOKUP($B25,Seznam!$A$4:$K$500,3))","v":""},{"$f":"IF($B25=\"\",\"\",VLOOKUP($B25,Seznam!$A$4:$K$500,4))","v":""},null,null,null,null,null,null,"",0]
["19.",null,{"$f":"IF($B26=\"\",\"\",VLOOKUP($B26,Seznam!$A$4:$K$500,2))","v":""},{"$f":"IF($B26=\"\",\"\",VLOOKUP($B26,Seznam!$A$4:$K$500,3))","v":""},{"$f":"IF($B26=\"\",\"\",VLOOKUP($B26,Seznam!$A$4:$K$500,4))","v":""},null,null,null,null,null,null,"",0]
["20.",null,{"$f":"IF($B27=\"\",\"\",VLOOKUP($B27,Seznam!$A$4:$K$500,2))","v":""},{"$f":"IF($B27=\"\",\"\",VLOOKUP($B27,Seznam!$A$4:$K$500,3))","v":""},{"$f":"IF($B27=\"\",\"\",VLOOKUP($B27,Seznam!$A$4:$K$500,4))","v":""},null,null,null,null,null,null,"",0]
[21,null,{"$f":"IF($B28=\"\",\"\",VLOOKUP($B28,Seznam!$A$4:$K$500,2))","v":""},{"$f":"IF($B28=\"\",\"\",VLOOKUP($B28,Seznam!$A$4:$K$500,3))","v":""},{"$f":"IF($B28=\"\",\"\",VLOOKUP($B28,Seznam!$A$4:$K$500,4))","v":""},null,null,null,null,null,null,"",0]
["22.",null,{"$f":"IF($B29=\"\",\"\",VLOOKUP($B29,Seznam!$A$4:$K$500,2))","v":""},{"$f":"IF($B29=\"\",\"\",VLOOKUP($B29,Seznam!$A$4:$K$500,3))","v":""},{"$f":"IF($B29=\"\",\"\",VLOOKUP($B29,Seznam!$A$4:$K$500,4))","v":""},null,null,null,null,null,null,"",0]
[]
[null,null,"Starší žáci"]
["poř.","č.h.","jméno","oddíl/klub","nar.",{"$f":"F6","v":"Fryd."},"Brušp.","ČT","ČT","Fryd.",0,"počet turnajů","celkem      bodů"]
["1.",38,{"$f":"IF($B33=\"\",\"\",VLOOKUP($B33,Seznam!$A$4:$K$500,2))","v":"Zvrtek Jan"},{"$f":"IF($B33=\"\",\"\",VLOOKUP($B33,Seznam!$A$4:$K$500,3))","v":"Návsí"},{"$f":"IF($B33=\"\",\"\",VLOOKUP($B33,Seznam!$A$4:$K$500,4))","v":2004},null,null,5,5,null,null,{"$f":"IF(AND(J33=\"\",F33=\"\",G33=\"\",H33=\"\",I33=\"\",K33),\"\",COUNTA(F33:K33))","v":2},{"$f":"IF(B33=\"\",0,SUM(IF(ISERROR(LARGE(F33:K33,1)),0,LARGE(F33:K33,1)),IF(ISERROR(LARGE(F33:K33,2)),0,LARGE(F33:K33,2)),IF(ISERROR(LARGE(F33:K33,3)),0,LARGE(F33:K33,3)),IF(ISERROR(LARGE(F33:K33,4)),0,LARGE(F33:K33,4))))","v":10}]
["2.",27,{"$f":"IF($B34=\"\",\"\",VLOOKUP($B34,Seznam!$A$4:$K$500,2))","v":"Hýl Jakub"},{"$f":"IF($B34=\"\",\"\",VLOOKUP($B34,Seznam!$A$4:$K$500,3))","v":"Brušperk"},{"$f":"IF($B34=\"\",\"\",VLOOKUP($B34,Seznam!$A$4:$K$500,4))","v":2006},5,4,null,null,null,null,2,9]
["3.",95,{"$f":"IF($B35=\"\",\"\",VLOOKUP($B35,Seznam!$A$4:$K$500,2))","v":"Ondračka Adam"},{"$f":"IF($B35=\"\",\"\",VLOOKUP($B35,Seznam!$A$4:$K$500,3))","v":"Frýdlant"},{"$f":"IF($B35=\"\",\"\",VLOOKUP($B35,Seznam!$A$4:$K$500,4))","v":2007},4,null,4,null,null,null,2,8]
["4.",97,{"$f":"IF($B36=\"\",\"\",VLOOKUP($B36,Seznam!$A$4:$K$500,2))","v":"Bakota Adam"},{"$f":"IF($B36=\"\",\"\",VLOOKUP($B36,Seznam!$A$4:$K$500,3))","v":"Frýdlant"},{"$f":"IF($B36=\"\",\"\",VLOOKUP($B36,Seznam!$A$4:$K$500,4))","v":2006},null,3,3,null,null,null,2,6]
["5.",98,{"$f":"IF($B37=\"\",\"\",VLOOKUP($B37,Seznam!$A$4:$K$500,2))","v":"Hamar Tomáš"},{"$f":"IF($B37=\"\",\"\",VLOOKUP($B37,Seznam!$A$4:$K$500,3))","v":"Brušperk"},{"$f":"IF($B37=\"\",\"\",VLOOKUP($B37,Seznam!$A$4:$K$500,4))","v":2004},1,2,null,3,null,null,3,6]
["6.",20,{"$f":"IF($B38=\"\",\"\",VLOOKUP($B38,Seznam!$A$4:$K$500,2))","v":"Mrowetz Bruno"},{"$f":"IF($B38=\"\",\"\",VLOOKUP($B38,Seznam!$A$4:$K$500,3))","v":"Brušperk"},{"$f":"IF($B38=\"\",\"\",VLOOKUP($B38,Seznam!$A$4:$K$500,4))","v":2004},null,5,null,null,null,null,1,5]
["7.",138,{"$f":"IF($B39=\"\",\"\",VLOOKUP($B39,Seznam!$A$4:$K$500,2))","v":"Halfar Jan"},{"$f":"IF($B39=\"\",\"\",VLOOKUP($B39,Seznam!$A$4:$K$500,3))","v":"Český Těšín"},{"$f":"IF($B39=\"\",\"\",VLOOKUP($B39,Seznam!$A$4:$K$500,4))","v":2005},null,null,null,4,null,null,1,4]
["8.",9,{"$f":"IF($B40=\"\",\"\",VLOOKUP($B40,Seznam!$A$4:$K$500,2))","v":"Šlachta Prokop Antonín"},{"$f":"IF($B40=\"\",\"\",VLOOKUP($B40,Seznam!$A$4:$K$500,3))","v":"Frýdek - Místek"},{"$f":"IF($B40=\"\",\"\",VLOOKUP($B40,Seznam!$A$4:$K$500,4))","v":2006},3,null,null,null,null,null,1,3]
["9.",82,{"$f":"IF($B41=\"\",\"\",VLOOKUP($B41,Seznam!$A$4:$K$500,2))","v":"Pánek Jakub"},{"$f":"IF($B41=\"\",\"\",VLOOKUP($B41,Seznam!$A$4:$K$500,3))","v":"Kozlovice"},{"$f":"IF($B41=\"\",\"\",VLOOKUP($B41,Seznam!$A$4:$K$500,4))","v":2005},2,1,null,null,null,null,2,3]
["10.",39,{"$f":"IF($B42=\"\",\"\",VLOOKUP($B42,Seznam!$A$4:$K$500,2))","v":"Walek Adrian"},{"$f":"IF($B42=\"\",\"\",VLOOKUP($B42,Seznam!$A$4:$K$500,3))","v":"Návsí"},{"$f":"IF($B42=\"\",\"\",VLOOKUP($B42,Seznam!$A$4:$K$500,4))","v":2005},null,null,2,null,null,null,1,2]
["11.",118,{"$f":"IF($B43=\"\",\"\",VLOOKUP($B43,Seznam!$A$4:$K$500,2))","v":"Krucina Vojtěch"},{"$f":"IF($B43=\"\",\"\",VLOOKUP($B43,Seznam!$A$4:$K$500,3))","v":"TJ Sokol Nýdek"},{"$f":"IF($B43=\"\",\"\",VLOOKUP($B43,Seznam!$A$4:$K$500,4))","v":2005},null,null,null,2,null,null,1,2]
["12.",65,{"$f":"IF($B44=\"\",\"\",VLOOKUP($B44,Seznam!$A$4:$K$500,2))","v":"Stramová Eliška"},{"$f":"IF($B44=\"\",\"\",VLOOKUP($B44,Seznam!$A$4:$K$500,3))","v":"Frýdlant"},{"$f":"IF($B44=\"\",\"\",VLOOKUP($B44,Seznam!$A$4:$K$500,4))","v":2005},null,null,1,null,null,null,1,1]
["13.",48,{"$f":"IF($B45=\"\",\"\",VLOOKUP($B45,Seznam!$A$4:$K$500,2))","v":"Michna Viktor"},{"$f":"IF($B45=\"\",\"\",VLOOKUP($B45,Seznam!$A$4:$K$500,3))","v":"Paskov"},{"$f":"IF($B45=\"\",\"\",VLOOKUP($B45,Seznam!$A$4:$K$500,4))","v":2004},null,null,null,1,null,null,1,1]
["14.",null,{"$f":"IF($B46=\"\",\"\",VLOOKUP($B46,Seznam!$A$4:$K$500,2))","v":""},{"$f":"IF($B46=\"\",\"\",VLOOKUP($B46,Seznam!$A$4:$K$500,3))","v":""},{"$f":"IF($B46=\"\",\"\",VLOOKUP($B46,Seznam!$A$4:$K$500,4))","v":""},null,null,null,null,null,null,"",0]
["15.",null,{"$f":"IF($B47=\"\",\"\",VLOOKUP($B47,Seznam!$A$4:$K$500,2))","v":""},{"$f":"IF($B47=\"\",\"\",VLOOKUP($B47,Seznam!$A$4:$K$500,3))","v":""},{"$f":"IF($B47=\"\",\"\",VLOOKUP($B47,Seznam!$A$4:$K$500,4))","v":""},null,null,null,null,null,null,"",0]
["16.",null,{"$f":"IF($B48=\"\",\"\",VLOOKUP($B48,Seznam!$A$4:$K$500,2))","v":""},{"$f":"IF($B48=\"\",\"\",VLOOKUP($B48,Seznam!$A$4:$K$500,3))","v":""},{"$f":"IF($B48=\"\",\"\",VLOOKUP($B48,Seznam!$A$4:$K$500,4))","v":""},null,null,null,null,null,null,"",0]
["17.",null,{"$f":"IF($B49=\"\",\"\",VLOOKUP($B49,Seznam!$A$4:$K$500,2))","v":""},{"$f":"IF($B49=\"\",\"\",VLOOKUP($B49,Seznam!$A$4:$K$500,3))","v":""},{"$f":"IF($B49=\"\",\"\",VLOOKUP($B49,Seznam!$A$4:$K$500,4))","v":""},null,null,null,null,null,null,"",0]
["18.",null,{"$f":"IF($B50=\"\",\"\",VLOOKUP($B50,Seznam!$A$4:$K$500,2))","v":""},{"$f":"IF($B50=\"\",\"\",VLOOKUP($B50,Seznam!$A$4:$K$500,3))","v":""},{"$f":"IF($B50=\"\",\"\",VLOOKUP($B50,Seznam!$A$4:$K$500,4))","v":""},null,null,null,null,null,null,"",0]
["19.",null,{"$f":"IF($B51=\"\",\"\",VLOOKUP($B51,Seznam!$A$4:$K$500,2))","v":""},{"$f":"IF($B51=\"\",\"\",VLOOKUP($B51,Seznam!$A$4:$K$500,3))","v":""},{"$f":"IF($B51=\"\",\"\",VLOOKUP($B51,Seznam!$A$4:$K$500,4))","v":""},null,null,null,null,null,null,"",0]
["20.",null,{"$f":"IF($B52=\"\",\"\",VLOOKUP($B52,Seznam!$A$4:$K$500,2))","v":""},{"$f":"IF($B52=\"\",\"\",VLOOKUP($B52,Seznam!$A$4:$K$500,3))","v":""},{"$f":"IF($B52=\"\",\"\",VLOOKUP($B52,Seznam!$A$4:$K$500,4))","v":""},null,null,null,null,null,null,"",0]
["21.",null,{"$f":"IF($B53=\"\",\"\",VLOOKUP($B53,Seznam!$A$4:$K$500,2))","v":""},{"$f":"IF($B53=\"\",\"\",VLOOKUP($B53,Seznam!$A$4:$K$500,3))","v":""},{"$f":"IF($B53=\"\",\"\",VLOOKUP($B53,Seznam!$A$4:$K$500,4))","v":""},null,null,null,null,null,null,"",0]
["22."]
[]
[null,null,"Mladší žáci"]
["poř.","č.h.","jméno","oddíl/klub","nar.",{"$f":"F6","v":"Fryd."},"Brušp.","ČT","ČT","Fryd.",0,"počet turnajů","celkem      bodů"]
["1.",27,{"$f":"IF($B58=\"\",\"\",VLOOKUP($B58,Seznam!$A$4:$K$500,2))","v":"Hýl Jakub"},{"$f":"IF($B58=\"\",\"\",VLOOKUP($B58,Seznam!$A$4:$K$500,3))","v":"Brušperk"},{"$f":"IF($B58=\"\",\"\",VLOOKUP($B58,Seznam!$A$4:$K$500,4))","v":2006},5,5,null,null,null,null,{"$f":"IF(AND(J58=\"\",F58=\"\",G58=\"\",H58=\"\",I58=\"\",K58=\"\"),\"\",COUNTA(F58:K58))","v":2},{"$f":"IF(B58=\"\",0,SUM(IF(ISERROR(LARGE(F58:K58,1)),0,LARGE(F58:K58,1)),IF(ISERROR(LARGE(F58:K58,2)),0,LARGE(F58:K58,2)),IF(ISERROR(LARGE(F58:K58,3)),0,LARGE(F58:K58,3)),IF(ISERROR(LARGE(F58:K58,4)),0,LARGE(F58:K58,4))))","v":10}]
["2.",62,{"$f":"IF($B59=\"\",\"\",VLOOKUP($B59,Seznam!$A$4:$K$500,2))","v":"Neuwirth Ondřej"},{"$f":"IF($B59=\"\",\"\",VLOOKUP($B59,Seznam!$A$4:$K$500,3))","v":"Brušperk"},{"$f":"IF($B59=\"\",\"\",VLOOKUP($B59,Seznam!$A$4:$K$500,4))","v":2006},1,2,2,5,null,null,4,10]
["3.",95,{"$f":"IF($B60=\"\",\"\",VLOOKUP($B60,Seznam!$A$4:$K$500,2))","v":"Ondračka Adam"},{"$f":"IF($B60=\"\",\"\",VLOOKUP($B60,Seznam!$A$4:$K$500,3))","v":"Frýdlant"},{"$f":"IF($B60=\"\",\"\",VLOOKUP($B60,Seznam!$A$4:$K$500,4))","v":2007},4,null,5,null,null,null,2,9]
["4.",65,{"$f":"IF($B61=\"\",\"\",VLOOKUP($B61,Seznam!$A$4:$K$500,2))","v":"Stramová Eliška"},{"$f":"IF($B61=\"\",\"\",VLOOKUP($B61,Seznam!$A$4:$K$500,3))","v":"Frýdlant"},{"$f":"IF($B61=\"\",\"\",VLOOKUP($B61,Seznam!$A$4:$K$500,4))","v":2005},2,3,3,null,null,null,3,8]
["5.",97,{"$f":"IF($B62=\"\",\"\",VLOOKUP($B62,Seznam!$A$4:$K$500,2))","v":"Bakota Adam"},{"$f":"IF($B62=\"\",\"\",VLOOKUP($B62,Seznam!$A$4:$K$500,3))","v":"Frýdlant"},{"$f":"IF($B62=\"\",\"\",VLOOKUP($B62,Seznam!$A$4:$K$500,4))","v":2006},null,4,4,null,null,null,2,8]
["6.",17,{"$f":"IF($B63=\"\",\"\",VLOOKUP($B63,Seznam!$A$4:$K$500,2))","v":"Michnová Marika"},{"$f":"IF($B63=\"\",\"\",VLOOKUP($B63,Seznam!$A$4:$K$500,3))","v":"SK Frýdlant"},{"$f":"IF($B63=\"\",\"\",VLOOKUP($B63,Seznam!$A$4:$K$500,4))","v":2008},null,1,null,4,null,null,2,5]
["7.",9,{"$f":"IF($B64=\"\",\"\",VLOOKUP($B64,Seznam!$A$4:$K$500,2))","v":"Šlachta Prokop Antonín"},{"$f":"IF($B64=\"\",\"\",VLOOKUP($B64,Seznam!$A$4:$K$500,3))","v":"Frýdek - Místek"},{"$f":"IF($B64=\"\",\"\",VLOOKUP($B64,Seznam!$A$4:$K$500,4))","v":2006},3,null,null,null,null,null,1,3]
["8.",58,{"$f":"IF($B65=\"\",\"\",VLOOKUP($B65,Seznam!$A$4:$K$500,2))","v":"Chudíková Nikol"},{"$f":"IF($B65=\"\",\"\",VLOOKUP($B65,Seznam!$A$4:$K$500,3))","v":"Komorní Lhotka"},{"$f":"IF($B65=\"\",\"\",VLOOKUP($B65,Seznam!$A$4:$K$500,4))","v":2007},null,null,null,3,null,null,1,3]
["9.",56,{"$f":"IF($B66=\"\",\"\",VLOOKUP($B66,Seznam!$A$4:$K$500,2))","v":"Stodůlková Tereza"},{"$f":"IF($B66=\"\",\"\",VLOOKUP($B66,Seznam!$A$4:$K$500,3))","v":"SK Frýdlant"},{"$f":"IF($B66=\"\",\"\",VLOOKUP($B66,Seznam!$A$4:$K$500,4))","v":2008},null,null,null,2,null,null,1,2]
["10.",132,{"$f":"IF($B67=\"\",\"\",VLOOKUP($B67,Seznam!$A$4:$K$500,2))","v":"Heczko David"},{"$f":"IF($B67=\"\",\"\",VLOOKUP($B67,Seznam!$A$4:$K$500,3))","v":"Návsí"},{"$f":"IF($B67=\"\",\"\",VLOOKUP($B67,Seznam!$A$4:$K$500,4))","v":2007},null,null,1,null,null,null,1,1]
["11.",1,{"$f":"IF($B68=\"\",\"\",VLOOKUP($B68,Seznam!$A$4:$K$500,2))","v":"Jančák Richard"},{"$f":"IF($B68=\"\",\"\",VLOOKUP($B68,Seznam!$A$4:$K$500,3))","v":"Brušperk"},{"$f":"IF($B68=\"\",\"\",VLOOKUP($B68,Seznam!$A$4:$K$500,4))","v":2006},null,null,null,1,null,null,1,1]
["12.",null,{"$f":"IF($B69=\"\",\"\",VLOOKUP($B69,Seznam!$A$4:$K$500,2))","v":""},{"$f":"IF($B69=\"\",\"\",VLOOKUP($B69,Seznam!$A$4:$K$500,3))","v":""},{"$f":"IF($B69=\"\",\"\",VLOOKUP($B69,Seznam!$A$4:$K$500,4))","v":""},null,null,null,null,null,null,"",0]
["13.",null,{"$f":"IF($B70=\"\",\"\",VLOOKUP($B70,Seznam!$A$4:$K$500,2))","v":""},{"$f":"IF($B70=\"\",\"\",VLOOKUP($B70,Seznam!$A$4:$K$500,3))","v":""},{"$f":"IF($B70=\"\",\"\",VLOOKUP($B70,Seznam!$A$4:$K$500,4))","v":""},null,null,null,null,null,null,"",0]
["14.",null,{"$f":"IF($B71=\"\",\"\",VLOOKUP($B71,Seznam!$A$4:$K$500,2))","v":""},{"$f":"IF($B71=\"\",\"\",VLOOKUP($B71,Seznam!$A$4:$K$500,3))","v":""},{"$f":"IF($B71=\"\",\"\",VLOOKUP($B71,Seznam!$A$4:$K$500,4))","v":""},null,null,null,null,null,null,"",0]
["15.",null,{"$f":"IF($B72=\"\",\"\",VLOOKUP($B72,Seznam!$A$4:$K$500,2))","v":""},{"$f":"IF($B72=\"\",\"\",VLOOKUP($B72,Seznam!$A$4:$K$500,3))","v":""},{"$f":"IF($B72=\"\",\"\",VLOOKUP($B72,Seznam!$A$4:$K$500,4))","v":""},null,null,null,null,null,null,{"$f":"IF(AND(J72=\"\",F72=\"\",G72=\"\",H72=\"\",I72=\"\",K72),\"\",COUNTA(F72:K72))","v":""},0]
["16.",null,{"$f":"IF($B73=\"\",\"\",VLOOKUP($B73,Seznam!$A$4:$K$500,2))","v":""},{"$f":"IF($B73=\"\",\"\",VLOOKUP($B73,Seznam!$A$4:$K$500,3))","v":""},{"$f":"IF($B73=\"\",\"\",VLOOKUP($B73,Seznam!$A$4:$K$500,4))","v":""},null,null,null,null,null,null,{"$f":"IF(AND(J73=\"\",F73=\"\",G73=\"\",H73=\"\",I73=\"\",K73=\"\"),\"\",COUNTA(F73:K73))","v":""},0]
["17.",null,{"$f":"IF($B74=\"\",\"\",VLOOKUP($B74,Seznam!$A$4:$K$500,2))","v":""},{"$f":"IF($B74=\"\",\"\",VLOOKUP($B74,Seznam!$A$4:$K$500,3))","v":""},{"$f":"IF($B74=\"\",\"\",VLOOKUP($B74,Seznam!$A$4:$K$500,4))","v":""},null,null,null,null,null,null,"",0]
["18.",null,{"$f":"IF($B75=\"\",\"\",VLOOKUP($B75,Seznam!$A$4:$K$500,2))","v":""},{"$f":"IF($B75=\"\",\"\",VLOOKUP($B75,Seznam!$A$4:$K$500,3))","v":""},{"$f":"IF($B75=\"\",\"\",VLOOKUP($B75,Seznam!$A$4:$K$500,4))","v":""},null,null,null,null,null,null,"",0]
["19.",null,{"$f":"IF($B76=\"\",\"\",VLOOKUP($B76,Seznam!$A$4:$K$500,2))","v":""},{"$f":"IF($B76=\"\",\"\",VLOOKUP($B76,Seznam!$A$4:$K$500,3))","v":""},{"$f":"IF($B76=\"\",\"\",VLOOKUP($B76,Seznam!$A$4:$K$500,4))","v":""},null,null,null,null,null,null,"",0]
["20.",null,{"$f":"IF($B77=\"\",\"\",VLOOKUP($B77,Seznam!$A$4:$K$500,2))","v":""},{"$f":"IF($B77=\"\",\"\",VLOOKUP($B77,Seznam!$A$4:$K$500,3))","v":""},{"$f":"IF($B77=\"\",\"\",VLOOKUP($B77,Seznam!$A$4:$K$500,4))","v":""},null,null,null,null,null,null,"",0]
["21.",null,{"$f":"IF($B78=\"\",\"\",VLOOKUP($B78,Seznam!$A$4:$K$500,2))","v":""},{"$f":"IF($B78=\"\",\"\",VLOOKUP($B78,Seznam!$A$4:$K$500,3))","v":""},{"$f":"IF($B78=\"\",\"\",VLOOKUP($B78,Seznam!$A$4:$K$500,4))","v":""},null,null,null,null,null,null,"",0]
["22.",null,{"$f":"IF($B79=\"\",\"\",VLOOKUP($B79,Seznam!$A$4:$K$500,2))","v":""},{"$f":"IF($B79=\"\",\"\",VLOOKUP($B79,Seznam!$A$4:$K$500,3))","v":""},{"$f":"IF($B79=\"\",\"\",VLOOKUP($B79,Seznam!$A$4:$K$500,4))","v":""},null,null,null,null,null,null,"",0]
["23.",null,{"$f":"IF($B80=\"\",\"\",VLOOKUP($B80,Seznam!$A$4:$K$500,2))","v":""},{"$f":"IF($B80=\"\",\"\",VLOOKUP($B80,Seznam!$A$4:$K$500,3))","v":""},{"$f":"IF($B80=\"\",\"\",VLOOKUP($B80,Seznam!$A$4:$K$500,4))","v":""},null,null,null,null,null,null,"",0]
["24.",null,{"$f":"IF($B81=\"\",\"\",VLOOKUP($B81,Seznam!$A$4:$K$500,2))","v":""},{"$f":"IF($B81=\"\",\"\",VLOOKUP($B81,Seznam!$A$4:$K$500,3))","v":""},{"$f":"IF($B81=\"\",\"\",VLOOKUP($B81,Seznam!$A$4:$K$500,4))","v":""},null,null,null,null,null,null,"",0]
["25.",null,{"$f":"IF($B82=\"\",\"\",VLOOKUP($B82,Seznam!$A$4:$K$500,2))","v":""},{"$f":"IF($B82=\"\",\"\",VLOOKUP($B82,Seznam!$A$4:$K$500,3))","v":""},{"$f":"IF($B82=\"\",\"\",VLOOKUP($B82,Seznam!$A$4:$K$500,4))","v":""},null,null,null,null,null,null,"",0]
["26.",null,{"$f":"IF($B83=\"\",\"\",VLOOKUP($B83,Seznam!$A$4:$K$500,2))","v":""},{"$f":"IF($B83=\"\",\"\",VLOOKUP($B83,Seznam!$A$4:$K$500,3))","v":""},{"$f":"IF($B83=\"\",\"\",VLOOKUP($B83,Seznam!$A$4:$K$500,4))","v":""},null,null,null,null,null,null,"",0]
["27.",null,{"$f":"IF($B84=\"\",\"\",VLOOKUP($B84,Seznam!$A$4:$K$500,2))","v":""},{"$f":"IF($B84=\"\",\"\",VLOOKUP($B84,Seznam!$A$4:$K$500,3))","v":""},{"$f":"IF($B84=\"\",\"\",VLOOKUP($B84,Seznam!$A$4:$K$500,4))","v":""},null,null,null,null,null,null,"",0]
[null,null,{"$f":"IF($B85=\"\",\"\",VLOOKUP($B85,Seznam!$A$4:$K$500,2))","v":""},{"$f":"IF($B85=\"\",\"\",VLOOKUP($B85,Seznam!$A$4:$K$500,3))","v":""},{"$f":"IF($B85=\"\",\"\",VLOOKUP($B85,Seznam!$A$4:$K$500,4))","v":""},null,null,null,null,null,null,"",0]
[null,null,"Nejmladší žáci"]
["poř.","č.h.","jméno","oddíl/klub","nar.",{"$f":"F6","v":"Fryd."},"Brušp.","ČT","ČT","Fryd.",0,"počet turnajů","celkem      bodů"]
["1.",17,{"$f":"IF($B88=\"\",\"\",VLOOKUP($B88,Seznam!$A$4:$K$500,2))","v":"Michnová Marika"},{"$f":"IF($B88=\"\",\"\",VLOOKUP($B88,Seznam!$A$4:$K$500,3))","v":"SK Frýdlant"},{"$f":"IF($B88=\"\",\"\",VLOOKUP($B88,Seznam!$A$4:$K$500,4))","v":2008},5,5,null,5,null,null,{"$f":"IF(AND(J88=\"\",F88=\"\",G88=\"\",H88=\"\",I88=\"\",K88=\"\"),\"\",COUNTA(F88:K88))","v":3},{"$f":"IF(B88=\"\",0,SUM(IF(ISERROR(LARGE(F88:K88,1)),0,LARGE(F88:K88,1)),IF(ISERROR(LARGE(F88:K88,2)),0,LARGE(F88:K88,2)),IF(ISERROR(LARGE(F88:K88,3)),0,LARGE(F88:K88,3)),IF(ISERROR(LARGE(F88:K88,4)),0,LARGE(F88:K88,4))))","v":15}]
["2.",134,{"$f":"IF($B89=\"\",\"\",VLOOKUP($B89,Seznam!$A$4:$K$500,2))","v":"Viňanský Pavel"},{"$f":"IF($B89=\"\",\"\",VLOOKUP($B89,Seznam!$A$4:$K$500,3))","v":"Brušperk"},{"$f":"IF($B89=\"\",\"\",VLOOKUP($B89,Seznam!$A$4:$K$500,4))","v":2008},1,2,5,2,null,null,4,10]
["3.",110,{"$f":"IF($B90=\"\",\"\",VLOOKUP($B90,Seznam!$A$4:$K$500,2))","v":"Fuchsík Šimon"},{"$f":"IF($B90=\"\",\"\",VLOOKUP($B90,Seznam!$A$4:$K$500,3))","v":"Frýdlant"},{"$f":"IF($B90=\"\",\"\",VLOOKUP($B90,Seznam!$A$4:$K$500,4))","v":2008},3,3,null,3,null,null,3,9]
["4.",30,{"$f":"IF($B91=\"\",\"\",VLOOKUP($B91,Seznam!$A$4:$K$500,2))","v":"Olejník Oliver"},{"$f":"IF($B91=\"\",\"\",VLOOKUP($B91,Seznam!$A$4:$K$500,3))","v":"TTC F-M"},{"$f":"IF($B91=\"\",\"\",VLOOKUP($B91,Seznam!$A$4:$K$500,4))","v":2011},4,null,null,null,null,null,1,4]
["5.",28,{"$f":"IF($B92=\"\",\"\",VLOOKUP($B92,Seznam!$A$4:$K$500,2))","v":"Domenyová Klára"},{"$f":"IF($B92=\"\",\"\",VLOOKUP($B92,Seznam!$A$4:$K$500,3))","v":"Český Těšín"},{"$f":"IF($B92=\"\",\"\",VLOOKUP($B92,Seznam!$A$4:$K$500,4))","v":2003},null,4,null,null,null,null,1,4]
["6.",24,{"$f":"IF($B93=\"\",\"\",VLOOKUP($B93,Seznam!$A$4:$K$500,2))","v":"Břenek Jiří"},{"$f":"IF($B93=\"\",\"\",VLOOKUP($B93,Seznam!$A$4:$K$500,3))","v":"Karviná"},{"$f":"IF($B93=\"\",\"\",VLOOKUP($B93,Seznam!$A$4:$K$500,4))","v":2009},null,null,4,null,null,null,1,4]
["7.",56,{"$f":"IF($B94=\"\",\"\",VLOOKUP($B94,Seznam!$A$4:$K$500,2))","v":"Stodůlková Tereza"},{"$f":"IF($B94=\"\",\"\",VLOOKUP($B94,Seznam!$A$4:$K$500,3))","v":"SK Frýdlant"},{"$f":"IF($B94=\"\",\"\",VLOOKUP($B94,Seznam!$A$4:$K$500,4))","v":2008},null,null,null,4,null,null,1,4]
["8.",41,{"$f":"IF($B95=\"\",\"\",VLOOKUP($B95,Seznam!$A$4:$K$500,2))","v":"Břenková Kristýna"},{"$f":"IF($B95=\"\",\"\",VLOOKUP($B95,Seznam!$A$4:$K$500,3))","v":"Karviná"},{"$f":"IF($B95=\"\",\"\",VLOOKUP($B95,Seznam!$A$4:$K$500,4))","v":2009},null,null,3,null,null,null,1,3]
["9.",25,{"$f":"IF($B96=\"\",\"\",VLOOKUP($B96,Seznam!$A$4:$K$500,2))","v":"Smetana Jan"},{"$f":"IF($B96=\"\",\"\",VLOOKUP($B96,Seznam!$A$4:$K$500,3))","v":"Třinec"},{"$f":"IF($B96=\"\",\"\",VLOOKUP($B96,Seznam!$A$4:$K$500,4))","v":2008},null,null,2,1,null,null,2,3]
["10.",124,{"$f":"IF($B97=\"\",\"\",VLOOKUP($B97,Seznam!$A$4:$K$500,2))","v":"Mlčoch Jan"},{"$f":"IF($B97=\"\",\"\",VLOOKUP($B97,Seznam!$A$4:$K$500,3))","v":"CDU Ostrava"},{"$f":"IF($B97=\"\",\"\",VLOOKUP($B97,Seznam!$A$4:$K$500,4))","v":2008},2,null,null,null,null,null,1,2]
["11.",35,{"$f":"IF($B98=\"\",\"\",VLOOKUP($B98,Seznam!$A$4:$K$500,2))","v":"Moravec Václav"},{"$f":"IF($B98=\"\",\"\",VLOOKUP($B98,Seznam!$A$4:$K$500,3))","v":"Paskov"},{"$f":"IF($B98=\"\",\"\",VLOOKUP($B98,Seznam!$A$4:$K$500,4))","v":2008},null,1,null,null,null,null,1,1]
["12.",142,{"$f":"IF($B99=\"\",\"\",VLOOKUP($B99,Seznam!$A$4:$K$500,2))","v":"Kotas Jakub"},{"$f":"IF($B99=\"\",\"\",VLOOKUP($B99,Seznam!$A$4:$K$500,3))","v":"Třinec"},{"$f":"IF($B99=\"\",\"\",VLOOKUP($B99,Seznam!$A$4:$K$500,4))","v":2008},null,null,1,null,null,null,1,1]
["13.",null,{"$f":"IF($B100=\"\",\"\",VLOOKUP($B100,Seznam!$A$4:$K$500,2))","v":""},{"$f":"IF($B100=\"\",\"\",VLOOKUP($B100,Seznam!$A$4:$K$500,3))","v":""},{"$f":"IF($B100=\"\",\"\",VLOOKUP($B100,Seznam!$A$4:$K$500,4))","v":""},null,null,null,null,null,null,"",0]
["14.",null,{"$f":"IF($B101=\"\",\"\",VLOOKUP($B101,Seznam!$A$4:$K$500,2))","v":""},{"$f":"IF($B101=\"\",\"\",VLOOKUP($B101,Seznam!$A$4:$K$500,3))","v":""},{"$f":"IF($B101=\"\",\"\",VLOOKUP($B101,Seznam!$A$4:$K$500,4))","v":""},null,null,null,null,null,null,"",0]
["15.",null,{"$f":"IF($B102=\"\",\"\",VLOOKUP($B102,Seznam!$A$4:$K$500,2))","v":""},{"$f":"IF($B102=\"\",\"\",VLOOKUP($B102,Seznam!$A$4:$K$500,3))","v":""},{"$f":"IF($B102=\"\",\"\",VLOOKUP($B102,Seznam!$A$4:$K$500,4))","v":""},null,null,null,null,null,null,"",0]
["16.",null,{"$f":"IF($B103=\"\",\"\",VLOOKUP($B103,Seznam!$A$4:$K$500,2))","v":""},{"$f":"IF($B103=\"\",\"\",VLOOKUP($B103,Seznam!$A$4:$K$500,3))","v":""},{"$f":"IF($B103=\"\",\"\",VLOOKUP($B103,Seznam!$A$4:$K$500,4))","v":""},null,null,null,null,null,null,"",0]
["17.",null,{"$f":"IF($B104=\"\",\"\",VLOOKUP($B104,Seznam!$A$4:$K$500,2))","v":""},{"$f":"IF($B104=\"\",\"\",VLOOKUP($B104,Seznam!$A$4:$K$500,3))","v":""},{"$f":"IF($B104=\"\",\"\",VLOOKUP($B104,Seznam!$A$4:$K$500,4))","v":""},null,null,null,null,null,null,"",0]
["18.",null,{"$f":"IF($B105=\"\",\"\",VLOOKUP($B105,Seznam!$A$4:$K$500,2))","v":""},{"$f":"IF($B105=\"\",\"\",VLOOKUP($B105,Seznam!$A$4:$K$500,3))","v":""},{"$f":"IF($B105=\"\",\"\",VLOOKUP($B105,Seznam!$A$4:$K$500,4))","v":""},null,null,null,null,null,null,"",0]
["19.",null,{"$f":"IF($B106=\"\",\"\",VLOOKUP($B106,Seznam!$A$4:$K$500,2))","v":""},{"$f":"IF($B106=\"\",\"\",VLOOKUP($B106,Seznam!$A$4:$K$500,3))","v":""},{"$f":"IF($B106=\"\",\"\",VLOOKUP($B106,Seznam!$A$4:$K$500,4))","v":""},null,null,null,null,null,null,"",0]
["20.",null,{"$f":"IF($B107=\"\",\"\",VLOOKUP($B107,Seznam!$A$4:$K$500,2))","v":""},{"$f":"IF($B107=\"\",\"\",VLOOKUP($B107,Seznam!$A$4:$K$500,3))","v":""},{"$f":"IF($B107=\"\",\"\",VLOOKUP($B107,Seznam!$A$4:$K$500,4))","v":""},null,null,null,null,null,null,"",0]
["21.",null,{"$f":"IF($B108=\"\",\"\",VLOOKUP($B108,Seznam!$A$4:$K$500,2))","v":""},{"$f":"IF($B108=\"\",\"\",VLOOKUP($B108,Seznam!$A$4:$K$500,3))","v":""},{"$f":"IF($B108=\"\",\"\",VLOOKUP($B108,Seznam!$A$4:$K$500,4))","v":""},null,null,null,null,null,null,"",0]
["22.",null,{"$f":"IF($B109=\"\",\"\",VLOOKUP($B109,Seznam!$A$4:$K$500,2))","v":""},{"$f":"IF($B109=\"\",\"\",VLOOKUP($B109,Seznam!$A$4:$K$500,3))","v":""},{"$f":"IF($B109=\"\",\"\",VLOOKUP($B109,Seznam!$A$4:$K$500,4))","v":""},null,null,null,null,null,null,"",0]
["23.",null,{"$f":"IF($B110=\"\",\"\",VLOOKUP($B110,Seznam!$A$4:$K$500,2))","v":""},{"$f":"IF($B110=\"\",\"\",VLOOKUP($B110,Seznam!$A$4:$K$500,3))","v":""},{"$f":"IF($B110=\"\",\"\",VLOOKUP($B110,Seznam!$A$4:$K$500,4))","v":""},null,null,null,null,null,null,"",0]
["24.",null,{"$f":"IF($B111=\"\",\"\",VLOOKUP($B111,Seznam!$A$4:$K$500,2))","v":""},{"$f":"IF($B111=\"\",\"\",VLOOKUP($B111,Seznam!$A$4:$K$500,3))","v":""},{"$f":"IF($B111=\"\",\"\",VLOOKUP($B111,Seznam!$A$4:$K$500,4))","v":""},null,null,null,null,null,null,"",0]
["25.",null,{"$f":"IF($B112=\"\",\"\",VLOOKUP($B112,Seznam!$A$4:$K$500,2))","v":""},{"$f":"IF($B112=\"\",\"\",VLOOKUP($B112,Seznam!$A$4:$K$500,3))","v":""},{"$f":"IF($B112=\"\",\"\",VLOOKUP($B112,Seznam!$A$4:$K$500,4))","v":""},null,null,null,null,null,null,"",0]
["26.",null,{"$f":"IF($B113=\"\",\"\",VLOOKUP($B113,Seznam!$A$4:$K$500,2))","v":""},{"$f":"IF($B113=\"\",\"\",VLOOKUP($B113,Seznam!$A$4:$K$500,3))","v":""},{"$f":"IF($B113=\"\",\"\",VLOOKUP($B113,Seznam!$A$4:$K$500,4))","v":""},null,null,null,null,null,null,"",0]
["27.",null,{"$f":"IF($B114=\"\",\"\",VLOOKUP($B114,Seznam!$A$4:$K$500,2))","v":""},{"$f":"IF($B114=\"\",\"\",VLOOKUP($B114,Seznam!$A$4:$K$500,3))","v":""},{"$f":"IF($B114=\"\",\"\",VLOOKUP($B114,Seznam!$A$4:$K$500,4))","v":""},null,null,null,null,null,null,"",0]
["28.",null,{"$f":"IF($B115=\"\",\"\",VLOOKUP($B115,Seznam!$A$4:$K$500,2))","v":""},{"$f":"IF($B115=\"\",\"\",VLOOKUP($B115,Seznam!$A$4:$K$500,3))","v":""},{"$f":"IF($B115=\"\",\"\",VLOOKUP($B115,Seznam!$A$4:$K$500,4))","v":""},null,null,null,null,null,null,"",0]
["29.",null,{"$f":"IF($B116=\"\",\"\",VLOOKUP($B116,Seznam!$A$4:$K$500,2))","v":""},{"$f":"IF($B116=\"\",\"\",VLOOKUP($B116,Seznam!$A$4:$K$500,3))","v":""},{"$f":"IF($B116=\"\",\"\",VLOOKUP($B116,Seznam!$A$4:$K$500,4))","v":""},null,null,null,null,null,null,"",0]
["30.",null,{"$f":"IF($B117=\"\",\"\",VLOOKUP($B117,Seznam!$A$4:$K$500,2))","v":""},{"$f":"IF($B117=\"\",\"\",VLOOKUP($B117,Seznam!$A$4:$K$500,3))","v":""},{"$f":"IF($B117=\"\",\"\",VLOOKUP($B117,Seznam!$A$4:$K$500,4))","v":""},null,null,null,null,null,null,"",0]
["31.",null,{"$f":"IF($B118=\"\",\"\",VLOOKUP($B118,Seznam!$A$4:$K$500,2))","v":""},{"$f":"IF($B118=\"\",\"\",VLOOKUP($B118,Seznam!$A$4:$K$500,3))","v":""},{"$f":"IF($B118=\"\",\"\",VLOOKUP($B118,Seznam!$A$4:$K$500,4))","v":""},null,null,null,null,null,null,"",0]
["32.",null,{"$f":"IF($B119=\"\",\"\",VLOOKUP($B119,Seznam!$A$4:$K$500,2))","v":""},{"$f":"IF($B119=\"\",\"\",VLOOKUP($B119,Seznam!$A$4:$K$500,3))","v":""},{"$f":"IF($B119=\"\",\"\",VLOOKUP($B119,Seznam!$A$4:$K$500,4))","v":""},null,null,null,null,null,null,"",0]
["33.",null,{"$f":"IF($B120=\"\",\"\",VLOOKUP($B120,Seznam!$A$4:$K$500,2))","v":""},{"$f":"IF($B120=\"\",\"\",VLOOKUP($B120,Seznam!$A$4:$K$500,3))","v":""},{"$f":"IF($B120=\"\",\"\",VLOOKUP($B120,Seznam!$A$4:$K$500,4))","v":""},null,null,null,null,null,null,"",0]